BDBM120741 US8703767, 1
SMILES: C=CC(=O)Nc1cccc(c1)-c1nc(Nc2ccc(cc2)N2CCOCC2)nc2n[nH]cc12
InChI Key: InChIKey=AJRUCFATZODVHW-UHFFFAOYSA-N
Data: 2 IC50
Activity Spreadsheet -- Enzyme Inhibition Constant Data from BindingDB
Found 2 hits for monomerid = 120741
Trg + Lig
Ki
nM
ΔG°
kcal/mole
IC50
nM
Kd
nM
EC50/IC50
nM
koff
s-1
kon
M-1s-1
pHTemp
°C
Tyrosine-protein kinase BTK
(Homo sapiens (Human))
BDBM120741
(US8703767, 1)
Show SMILES C=CC(=O)Nc1cccc(c1)-c1nc(Nc2ccc(cc2)N2CCOCC2)nc2n[nH]cc12
Show InChI InChI=1S/C24H23N7O2/c1-2-21(32)26-18-5-3-4-16(14-18)22-20-15-25-30-23(20)29-24(28-22)27-17-6-8-19(9-7-17)31-10-12-33-13-11-31/h2-9,14-15H,1,10-13H2,(H,26,32)(H2,25,27,28,29,30)
NCI pathway
Reactome pathway
US Patent
n/an/a 45n/an/an/an/an/a25
University of Utah Research Foundation
US Patent
Assay Description
Activity of compounds was routinely confirmed using a secondary assay as described herein. The secondary assay was a time resolved-FRET kinase assay....
US Patent US8703767 (2014)
BindingDB Entry DOI: 10.7270/Q23X85BF
Tyrosine-protein kinase BTK
(Homo sapiens (Human))
BDBM120741
(US8703767, 1)
Show SMILES C=CC(=O)Nc1cccc(c1)-c1nc(Nc2ccc(cc2)N2CCOCC2)nc2n[nH]cc12
Show InChI InChI=1S/C24H23N7O2/c1-2-21(32)26-18-5-3-4-16(14-18)22-20-15-25-30-23(20)29-24(28-22)27-17-6-8-19(9-7-17)31-10-12-33-13-11-31/h2-9,14-15H,1,10-13H2,(H,26,32)(H2,25,27,28,29,30)
NCI pathway
Reactome pathway
US Patent
n/an/a 79n/an/an/an/an/a25
University of Utah Research Foundation
US Patent
Assay Description
The primary assay for compound inhibitory activity was the ADP generation assay described herein. Test compounds were diluted to desired concentratio...
US Patent US8703767 (2014)
BindingDB Entry DOI: 10.7270/Q23X85BF