BDBM12090 3-Amino-1,4,5,6-tetrahydropyrrolo[3,4-c]pyrazole 8::4-methyl-N-[5-(quinolin-8-ylcarbonyl)-1H,4H,5H,6H-pyrrolo[3,4-c]pyrazol-3-yl]benzamide
SMILES: Cc1ccc(cc1)C(=O)Nc1[nH]nc2CN(Cc12)C(=O)c1cccc2cccnc12
InChI Key: InChIKey=QVBATOUAXIHAHS-UHFFFAOYSA-N
Data: 2 IC50
Activity Spreadsheet -- Enzyme Inhibition Constant Data from BindingDB
Found 2 hits for monomerid = 12090
Trg + Lig
Ki
nM
ΔG°
kcal/mole
IC50
nM
Kd
nM
EC50/IC50
nM
koff
s-1
kon
M-1s-1
pHTemp
°C
Aurora kinase A
(Homo sapiens (Human))
BDBM12090
(3-Amino-1,4,5,6-tetrahydropyrrolo[3,4-c]pyrazole 8...)
Show SMILES Cc1ccc(cc1)C(=O)Nc1[nH]nc2CN(Cc12)C(=O)c1cccc2cccnc12
Show InChI InChI=1S/C23H19N5O2/c1-14-7-9-16(10-8-14)22(29)25-21-18-12-28(13-19(18)26-27-21)23(30)17-6-2-4-15-5-3-11-24-20(15)17/h2-11H,12-13H2,1H3,(H2,25,26,27,29)
NCI pathway
Reactome pathway
n/an/a 440n/an/an/an/an/an/a
Nerviano Medical Sciences
Assay Description
The biochemical activity of compounds was determined by incubation with specific enzymes and substrates in the presence ATP/[gamma-33P] ATP. After in...
Bioorg Med Chem Lett 16: 1084-90 (2006)
Article DOI: 10.1016/j.bmcl.2005.10.071
BindingDB Entry DOI: 10.7270/Q2PZ5725
Cyclin-Dependent Kinase 2 (CDK2)
(Homo sapiens (Human))
BDBM12090
(3-Amino-1,4,5,6-tetrahydropyrrolo[3,4-c]pyrazole 8...)
Show SMILES Cc1ccc(cc1)C(=O)Nc1[nH]nc2CN(Cc12)C(=O)c1cccc2cccnc12
Show InChI InChI=1S/C23H19N5O2/c1-14-7-9-16(10-8-14)22(29)25-21-18-12-28(13-19(18)26-27-21)23(30)17-6-2-4-15-5-3-11-24-20(15)17/h2-11H,12-13H2,1H3,(H2,25,26,27,29)
NCI pathway
Reactome pathway
n/an/a 1.05E+3n/an/an/an/a7.422
Nerviano Medical Sciences
Assay Description
The biochemical activity of compounds was determined by incubation with specific enzymes and substrates in the presence ATP/[gamma-33P] ATP. After in...
Bioorg Med Chem Lett 16: 1084-90 (2006)
Article DOI: 10.1016/j.bmcl.2005.10.071
BindingDB Entry DOI: 10.7270/Q2PZ5725