BDBM120921 US8716287, 54
SMILES: COc1cc(CCNCc2ccc3OCOc3c2)c(Cl)cc1NC(=O)Nc1cnc(cn1)C#N
InChI Key: InChIKey=PCZQKWYJTOATEG-UHFFFAOYSA-N
Data: 1 IC50
Activity Spreadsheet -- Enzyme Inhibition Constant Data from BindingDB
Found 1 hit for monomerid = 120921
Trg + Lig
Ki
nM
ΔG°
kcal/mole
IC50
nM
Kd
nM
EC50/IC50
nM
koff
s-1
kon
M-1s-1
pHTemp
°C
Serine/threonine-protein kinase Chk1
(Homo sapiens (Human))
BDBM120921
(US8716287, 54)
Show SMILES COc1cc(CCNCc2ccc3OCOc3c2)c(Cl)cc1NC(=O)Nc1cnc(cn1)C#N
Show InChI InChI=1S/C23H21ClN6O4/c1-32-20-7-15(4-5-26-10-14-2-3-19-21(6-14)34-13-33-19)17(24)8-18(20)29-23(31)30-22-12-27-16(9-25)11-28-22/h2-3,6-8,11-12,26H,4-5,10,13H2,1H3,(H2,28,29,30,31)
Reactome pathway
US Patent
n/an/a 0.230n/an/an/an/a7.5n/a
Sentinel Oncology Limited
US Patent
Assay Description
The compounds of the invention were tested for activity against Chk-1 kinase using the materials and protocols set out below. Reaction Buffer: Base R...
US Patent US8716287 (2014)
BindingDB Entry DOI: 10.7270/Q2TD9W0C