null
SMILES: COc1cc(CCNCc2ccc(cc2)N2CCNCC2)c(Cl)cc1NC(=O)Nc1cnc(cn1)C#N
InChI Key: InChIKey=YQJXLELMHWTOFK-UHFFFAOYSA-N
Activity Spreadsheet -- Enzyme Inhibition Constant Data from BindingDB
Found 1 hit for monomerid = 120931
Trg + Lig
Ki
nM
ΔG°
kcal/mole
IC50
nM
Kd
nM
EC50/IC50
nM
koff
s-1
kon
M-1s-1
pHTemp
°C
Serine/threonine-protein kinase Chk1
(Homo sapiens (Human))
BDBM120931
(US8716287, 64)
Show SMILES COc1cc(CCNCc2ccc(cc2)N2CCNCC2)c(Cl)cc1NC(=O)Nc1cnc(cn1)C#N
Show InChI InChI=1S/C26H29ClN8O2/c1-37-24-12-19(6-7-30-15-18-2-4-21(5-3-18)35-10-8-29-9-11-35)22(27)13-23(24)33-26(36)34-25-17-31-20(14-28)16-32-25/h2-5,12-13,16-17,29-30H,6-11,15H2,1H3,(H2,32,33,34,36)
Reactome pathway
US Patent
n/an/a 0.0300n/an/an/an/a7.5n/a
Sentinel Oncology Limited
US Patent
Assay Description
The compounds of the invention were tested for activity against Chk-1 kinase using the materials and protocols set out below. Reaction Buffer: Base R...
US Patent US8716287 (2014)
BindingDB Entry DOI: 10.7270/Q2TD9W0C