null
SMILES: COc1ccccc1-c1cc(NC(=O)c2ccc(C)c(NS(C)(=O)=O)c2)ncn1
InChI Key: InChIKey=VDRNYWRYYIDFSU-UHFFFAOYSA-N
Activity Spreadsheet -- Enzyme Inhibition Constant Data from BindingDB
Found 1 hit for monomerid = 120939
Trg + Lig
Ki
nM
ΔG°
kcal/mole
IC50
nM
Kd
nM
EC50/IC50
nM
koff
s-1
kon
M-1s-1
pHTemp
°C
Cyclin-dependent kinase 9
(Homo sapiens (Human))
BDBM120939
(US8716296, 52)
Show SMILES COc1ccccc1-c1cc(NC(=O)c2ccc(C)c(NS(C)(=O)=O)c2)ncn1
Show InChI InChI=1S/C20H20N4O4S/c1-13-8-9-14(10-16(13)24-29(3,26)27)20(25)23-19-11-17(21-12-22-19)15-6-4-5-7-18(15)28-2/h4-12,24H,1-3H3,(H,21,22,23,25)
Reactome pathway
US Patent
n/an/a 0.116n/an/an/an/a7.5n/a
Ingenium Pharmaceuticals GmbH
US Patent
Assay Description
All kinase assays were performed in 96-well FlashPlates from Perkin Elmer/NEN (Boston, Mass., USA) in a 50 μl reaction volume. The reaction mixt...
US Patent US8716296 (2014)
BindingDB Entry DOI: 10.7270/Q2PN949G