BDBM120941 US8716296, 82
SMILES: COc1ccc(F)cc1-c1cc(NC(=O)Cc2cccnc2)ncn1
InChI Key: InChIKey=IPNAKQRJOWQSIM-UHFFFAOYSA-N
Data: 1 IC50
Activity Spreadsheet -- Enzyme Inhibition Constant Data from BindingDB
Found 1 hit for monomerid = 120941
Trg + Lig
Ki
nM
ΔG°
kcal/mole
IC50
nM
Kd
nM
EC50/IC50
nM
koff
s-1
kon
M-1s-1
pHTemp
°C
Cyclin-dependent kinase 9
(Homo sapiens (Human))
BDBM120941
(US8716296, 82)
Show SMILES COc1ccc(F)cc1-c1cc(NC(=O)Cc2cccnc2)ncn1
Show InChI InChI=1S/C18H15FN4O2/c1-25-16-5-4-13(19)8-14(16)15-9-17(22-11-21-15)23-18(24)7-12-3-2-6-20-10-12/h2-6,8-11H,7H2,1H3,(H,21,22,23,24)
Reactome pathway
US Patent
n/an/a 0.0150n/an/an/an/a7.5n/a
Ingenium Pharmaceuticals GmbH
US Patent
Assay Description
All kinase assays were performed in 96-well FlashPlates from Perkin Elmer/NEN (Boston, Mass., USA) in a 50 μl reaction volume. The reaction mixt...
US Patent US8716296 (2014)
BindingDB Entry DOI: 10.7270/Q2PN949G