BDBM120957 US8716285, 14
SMILES: ONC(=O)c1ccc2CCC(Cc2c1)Nc1nccc(n1)-c1cccc(Cl)c1
InChI Key: InChIKey=BLQDCUAHMUDLRG-UHFFFAOYSA-N
Data: 1 IC50  1 EC50
Activity Spreadsheet -- Enzyme Inhibition Constant Data from BindingDB
Found 2 hits for monomerid = 120957
Trg + Lig
Ki
nM
ΔG°
kcal/mole
IC50
nM
Kd
nM
EC50/IC50
nM
koff
s-1
kon
M-1s-1
pHTemp
°C
Cereblon/Histone deacetylase 6
(Homo sapiens (Human))
BDBM120957
(US8716285, 14)
Show SMILES ONC(=O)c1ccc2CCC(Cc2c1)Nc1nccc(n1)-c1cccc(Cl)c1
Show InChI InChI=1S/C21H19ClN4O2/c22-17-3-1-2-14(11-17)19-8-9-23-21(25-19)24-18-7-6-13-4-5-15(20(27)26-28)10-16(13)12-18/h1-5,8-11,18,28H,6-7,12H2,(H,26,27)(H,23,24,25)
NCI pathway
Reactome pathway
n/an/an/an/a 4.95E+3n/an/an/an/a
Roche Pharmaceutical Research and Early Development
Curated by ChEMBL
Assay Description
Inhibition of HDAC6 in human A549 cells assessed as tubulin acetylation after 17 to 18 hrs by cytoblot assay
J Med Chem 57: 8026-34 (2014)
Article DOI: 10.1021/jm5008962
BindingDB Entry DOI: 10.7270/Q29C700V
Histone deacetylase 8
(Homo sapiens (Human))
BDBM120957
(US8716285, 14)
Show SMILES ONC(=O)c1ccc2CCC(Cc2c1)Nc1nccc(n1)-c1cccc(Cl)c1
Show InChI InChI=1S/C21H19ClN4O2/c22-17-3-1-2-14(11-17)19-8-9-23-21(25-19)24-18-7-6-13-4-5-15(20(27)26-28)10-16(13)12-18/h1-5,8-11,18,28H,6-7,12H2,(H,26,27)(H,23,24,25)
NCI pathway
Reactome pathway
US Patent
n/an/a 1.66E+3n/an/an/an/an/an/a
Hoffmann-La Roche Inc.
US Patent
Assay Description
Compounds were tested for their ability to inhibit histone deacetylase 8 using an in vitro deacetylation assay. In a detailed procedure, 8 μl o...
US Patent US8716285 (2014)
BindingDB Entry DOI: 10.7270/Q2K072XG