BDBM12116 3-(Indol-2-yl)indazole 6::3-[5-(morpholin-4-ylmethyl)-1H-indol-2-yl]-1H-indazole-6-carbonitrile
SMILES: N#Cc1ccc2c(n[nH]c2c1)-c1cc2cc(CN3CCOCC3)ccc2[nH]1
InChI Key: InChIKey=QJRKDESSUVYBDT-UHFFFAOYSA-N
Data: 4 IC50
Activity Spreadsheet -- Enzyme Inhibition Constant Data from BindingDB
Found 4 hits for monomerid = 12116
Trg + Lig
Ki
nM
ΔG°
kcal/mole
IC50
nM
Kd
nM
EC50/IC50
nM
koff
s-1
kon
M-1s-1
pHTemp
°C
Serine/threonine-protein kinase Chk1
(Homo sapiens (Human))
BDBM12116
(3-(Indol-2-yl)indazole 6 | 3-[5-(morpholin-4-ylmet...)
Show SMILES N#Cc1ccc2c(n[nH]c2c1)-c1cc2cc(CN3CCOCC3)ccc2[nH]1
Show InChI InChI=1S/C21H19N5O/c22-12-14-1-3-17-19(10-14)24-25-21(17)20-11-16-9-15(2-4-18(16)23-20)13-26-5-7-27-8-6-26/h1-4,9-11,23H,5-8,13H2,(H,24,25)
Reactome pathway
n/an/a 30n/an/an/an/a7.522
Merck Research Laboratories
Assay Description
Kinase activity was measured in a homogeneous assay in a 96-well format. Detection was performed by HTRF using an EuK-labelled anti-phospho(S21)-GSK3...
Bioorg Med Chem Lett 16: 6049-53 (2006)
Article DOI: 10.1016/j.bmcl.2006.08.118
BindingDB Entry DOI: 10.7270/Q29P2ZVV
3D
3D Structure (docked)
Cyclin-dependent kinase 7
(Homo sapiens (Human))
BDBM12116
(3-(Indol-2-yl)indazole 6 | 3-[5-(morpholin-4-ylmet...)
Show SMILES N#Cc1ccc2c(n[nH]c2c1)-c1cc2cc(CN3CCOCC3)ccc2[nH]1
Show InChI InChI=1S/C21H19N5O/c22-12-14-1-3-17-19(10-14)24-25-21(17)20-11-16-9-15(2-4-18(16)23-20)13-26-5-7-27-8-6-26/h1-4,9-11,23H,5-8,13H2,(H,24,25)
NCI pathway
Reactome pathway
n/an/a 11n/an/an/an/an/an/a
Zhejiang University
Curated by ChEMBL
Assay Description
Inhibition of CDC7 (unknown origin)
Bioorg Med Chem 23: 1858-68 (2015)
Article DOI: 10.1016/j.bmc.2015.02.004
BindingDB Entry DOI: 10.7270/Q26H4K23
Serine/threonine-protein kinase Chk1
(Homo sapiens (Human))
BDBM12116
(3-(Indol-2-yl)indazole 6 | 3-[5-(morpholin-4-ylmet...)
Show SMILES N#Cc1ccc2c(n[nH]c2c1)-c1cc2cc(CN3CCOCC3)ccc2[nH]1
Show InChI InChI=1S/C21H19N5O/c22-12-14-1-3-17-19(10-14)24-25-21(17)20-11-16-9-15(2-4-18(16)23-20)13-26-5-7-27-8-6-26/h1-4,9-11,23H,5-8,13H2,(H,24,25)
Reactome pathway
n/an/a 30n/an/an/an/an/an/a
Zhejiang University
Curated by ChEMBL
Assay Description
Inhibition of CHK1 (unknown origin)
Bioorg Med Chem 23: 1858-68 (2015)
Article DOI: 10.1016/j.bmc.2015.02.004
BindingDB Entry DOI: 10.7270/Q26H4K23
3D
3D Structure (docked)
Cyclin-Dependent Kinase 7 (CDK7)
(Homo sapiens (Human))
BDBM12116
(3-(Indol-2-yl)indazole 6 | 3-[5-(morpholin-4-ylmet...)
Show SMILES N#Cc1ccc2c(n[nH]c2c1)-c1cc2cc(CN3CCOCC3)ccc2[nH]1
Show InChI InChI=1S/C21H19N5O/c22-12-14-1-3-17-19(10-14)24-25-21(17)20-11-16-9-15(2-4-18(16)23-20)13-26-5-7-27-8-6-26/h1-4,9-11,23H,5-8,13H2,(H,24,25)
NCI pathway
Reactome pathway
n/an/a 11n/an/an/an/an/an/a
Merck Research Laboratories
Assay Description
The IMAP technology is based on the high affinity binding of phosphate by immobilized metal coordination complexes on nanoparticles. This IMAP bindin...
Bioorg Med Chem Lett 16: 6049-53 (2006)
Article DOI: 10.1016/j.bmcl.2006.08.118
BindingDB Entry DOI: 10.7270/Q29P2ZVV