BDBM12133 3-(Indol-2-yl)indazole 23::[5-(3-{5-[(4-fluoropiperidin-1-yl)methyl]-1H-indol-2-yl}-1H-indazol-6-yl)-1H-1,2,3-triazol-4-yl]methanamine
SMILES: NCc1[nH]nnc1-c1ccc2c(n[nH]c2c1)-c1cc2cc(CN3CCC(F)CC3)ccc2[nH]1
InChI Key: InChIKey=PTTHTNNSSNKMSD-UHFFFAOYSA-N
Data: 2 IC50
Activity Spreadsheet -- Enzyme Inhibition Constant Data from BindingDB
Found 2 hits for monomerid = 12133
Trg + Lig
Ki
nM
ΔG°
kcal/mole
IC50
nM
Kd
nM
EC50/IC50
nM
koff
s-1
kon
M-1s-1
pHTemp
°C
Cyclin-Dependent Kinase 7 (CDK7)
(Homo sapiens (Human))
BDBM12133
(3-(Indol-2-yl)indazole 23 | [5-(3-{5-[(4-fluoropip...)
Show SMILES NCc1[nH]nnc1-c1ccc2c(n[nH]c2c1)-c1cc2cc(CN3CCC(F)CC3)ccc2[nH]1
Show InChI InChI=1S/C24H25FN8/c25-17-5-7-33(8-6-17)13-14-1-4-19-16(9-14)11-21(27-19)24-18-3-2-15(10-20(18)28-30-24)23-22(12-26)29-32-31-23/h1-4,9-11,17,27H,5-8,12-13,26H2,(H,28,30)(H,29,31,32)
NCI pathway
Reactome pathway
n/an/a 300n/an/an/an/an/an/a
Merck Research Laboratories
Assay Description
The IMAP technology is based on the high affinity binding of phosphate by immobilized metal coordination complexes on nanoparticles. This IMAP bindin...
Bioorg Med Chem Lett 16: 6049-53 (2006)
Article DOI: 10.1016/j.bmcl.2006.08.118
BindingDB Entry DOI: 10.7270/Q29P2ZVV
Serine/threonine-protein kinase Chk1
(Homo sapiens (Human))
BDBM12133
(3-(Indol-2-yl)indazole 23 | [5-(3-{5-[(4-fluoropip...)
Show SMILES NCc1[nH]nnc1-c1ccc2c(n[nH]c2c1)-c1cc2cc(CN3CCC(F)CC3)ccc2[nH]1
Show InChI InChI=1S/C24H25FN8/c25-17-5-7-33(8-6-17)13-14-1-4-19-16(9-14)11-21(27-19)24-18-3-2-15(10-20(18)28-30-24)23-22(12-26)29-32-31-23/h1-4,9-11,17,27H,5-8,12-13,26H2,(H,28,30)(H,29,31,32)
Reactome pathway
n/an/a 0.110n/an/an/an/a7.522
Merck Research Laboratories
Assay Description
Kinase activity was measured in a homogeneous assay in a 96-well format. Detection was performed by HTRF using an EuK-labelled anti-phospho(S21)-GSK3...
Bioorg Med Chem Lett 16: 6049-53 (2006)
Article DOI: 10.1016/j.bmcl.2006.08.118
BindingDB Entry DOI: 10.7270/Q29P2ZVV
3D
3D Structure (docked)