BDBM121544 US8729273, 14
SMILES: COCCn1cc(C#N)c2cc(ccc12)-n1cc(C(O)=O)c(C)n1
InChI Key: InChIKey=MKUBMXCDSIHRLC-UHFFFAOYSA-N
Data: 1 IC50
Activity Spreadsheet -- Enzyme Inhibition Constant Data from BindingDB
Found 1 hit for monomerid = 121544
Trg + Lig
Ki
nM
ΔG°
kcal/mole
IC50
nM
Kd
nM
EC50/IC50
nM
koff
s-1
kon
M-1s-1
pHTemp
°C
Xanthine dehydrogenase/oxidase
(Bos taurus (Bovine))
BDBM121544
(US8729273, 14)
Show SMILES COCCn1cc(C#N)c2cc(ccc12)-n1cc(C(O)=O)c(C)n1
Show InChI InChI=1S/C17H16N4O3/c1-11-15(17(22)23)10-21(19-11)13-3-4-16-14(7-13)12(8-18)9-20(16)5-6-24-2/h3-4,7,9-10H,5-6H2,1-2H3,(H,22,23)
US Patent
n/an/a 12n/an/an/an/an/an/a
LG Life Sciences Ltd.
US Patent
Assay Description
Xanthine oxidase originated from bovine milk was incubated for 3 min with test compounds, and the initial velocity of uric acid formation was determi...
US Patent US8729273 (2014)
BindingDB Entry DOI: 10.7270/Q2D79937