BDBM121550 US8729273, 20
SMILES: CC(C)n1cc(C#N)c2cc(ccc12)-c1ccc(s1)C(O)=O
InChI Key: InChIKey=OTMIYGLCTJPYGJ-UHFFFAOYSA-N
Data: 1 IC50
Activity Spreadsheet -- Enzyme Inhibition Constant Data from BindingDB
Found 1 hit for monomerid = 121550
Trg + Lig
Ki
nM
ΔG°
kcal/mole
IC50
nM
Kd
nM
EC50/IC50
nM
koff
s-1
kon
M-1s-1
pHTemp
°C
Xanthine dehydrogenase
(Bos taurus (Bovine))
BDBM121550
(US8729273, 20)
Show SMILES CC(C)n1cc(C#N)c2cc(ccc12)-c1ccc(s1)C(O)=O
Show InChI InChI=1S/C17H14N2O2S/c1-10(2)19-9-12(8-18)13-7-11(3-4-14(13)19)15-5-6-16(22-15)17(20)21/h3-7,9-10H,1-2H3,(H,20,21)
US Patent
n/an/a 4.70n/an/an/an/an/an/a
LG Life Sciences Ltd.
US Patent
Assay Description
Xanthine oxidase originated from bovine milk was incubated for 3 min with test compounds, and the initial velocity of uric acid formation was determi...
US Patent US8729273 (2014)
BindingDB Entry DOI: 10.7270/Q2D79937