null
SMILES: CC(C)n1cc([N+]([O-])=O)c2cc(ccc12)-c1cc(ccn1)C(O)=O
InChI Key: InChIKey=HYGGAHFIAPCNFF-UHFFFAOYSA-N
Activity Spreadsheet -- Enzyme Inhibition Constant Data from BindingDB
Found 1 hit for monomerid = 121557
Trg + Lig
Ki
nM
ΔG°
kcal/mole
IC50
nM
Kd
nM
EC50/IC50
nM
koff
s-1
kon
M-1s-1
pHTemp
°C
Xanthine dehydrogenase/oxidase
(Bos taurus (Bovine))
BDBM121557
(US8729273, 27)
Show SMILES CC(C)n1cc([N+]([O-])=O)c2cc(ccc12)-c1cc(ccn1)C(O)=O
Show InChI InChI=1S/C17H15N3O4/c1-10(2)19-9-16(20(23)24)13-7-11(3-4-15(13)19)14-8-12(17(21)22)5-6-18-14/h3-10H,1-2H3,(H,21,22)
US Patent
n/an/a 11n/an/an/an/an/an/a
LG Life Sciences Ltd.
US Patent
Assay Description
Xanthine oxidase originated from bovine milk was incubated for 3 min with test compounds, and the initial velocity of uric acid formation was determi...
US Patent US8729273 (2014)
BindingDB Entry DOI: 10.7270/Q2D79937