BDBM12188 2-(pyrrolidin-2-ylcarbonyl)-1,2,3,4-tetrahydroisoquinoline::isoquinoline derivative 11
SMILES: O=C(C1CCCN1)N1CCc2ccccc2C1
InChI Key: InChIKey=XVQFBLXWWPWKBC-UHFFFAOYSA-N
Data: 3 IC50
Activity Spreadsheet -- Enzyme Inhibition Constant Data from BindingDB
Found 3 hits for monomerid = 12188
Trg + Lig
Ki
nM
ΔG°
kcal/mole
IC50
nM
Kd
nM
EC50/IC50
nM
koff
s-1
kon
M-1s-1
pHTemp
°C
Dipeptidyl peptidase VIII
(Homo sapiens (Human))
BDBM12188
(2-(pyrrolidin-2-ylcarbonyl)-1,2,3,4-tetrahydroisoq...)
Show SMILES O=C(C1CCCN1)N1CCc2ccccc2C1
Show InChI InChI=1S/C14H18N2O/c17-14(13-6-3-8-15-13)16-9-7-11-4-1-2-5-12(11)10-16/h1-2,4-5,13,15H,3,6-10H2
n/an/a>1.00E+5n/an/an/an/a8.037
National Health Research Institutes
Assay Description
The enzyme activity resulted in the liberation of free pNA at 405 nm. Reaction progress was monitored using a Molecular Devices SpectraMax Plus micro...
Bioorg Med Chem Lett 15: 687-91 (2005)
Article DOI: 10.1016/j.bmcl.2004.11.023
BindingDB Entry DOI: 10.7270/Q2XG9PDW
Dipeptidyl peptidase 2 (DPP II)
(Homo sapiens (Human))
BDBM12188
(2-(pyrrolidin-2-ylcarbonyl)-1,2,3,4-tetrahydroisoq...)
Show SMILES O=C(C1CCCN1)N1CCc2ccccc2C1
Show InChI InChI=1S/C14H18N2O/c17-14(13-6-3-8-15-13)16-9-7-11-4-1-2-5-12(11)10-16/h1-2,4-5,13,15H,3,6-10H2
n/an/a>1.00E+5n/an/an/an/an/an/a
National Health Research Institutes
Assay Description
The enzyme activity resulted in the liberation of free pNA at 405 nm. Reaction progress was monitored using a Molecular Devices SpectraMax Plus micro...
Bioorg Med Chem Lett 15: 687-91 (2005)
Article DOI: 10.1016/j.bmcl.2004.11.023
BindingDB Entry DOI: 10.7270/Q2XG9PDW
Dipeptidyl peptidase 4
(Homo sapiens (Human))
BDBM12188
(2-(pyrrolidin-2-ylcarbonyl)-1,2,3,4-tetrahydroisoq...)
Show SMILES O=C(C1CCCN1)N1CCc2ccccc2C1
Show InChI InChI=1S/C14H18N2O/c17-14(13-6-3-8-15-13)16-9-7-11-4-1-2-5-12(11)10-16/h1-2,4-5,13,15H,3,6-10H2
Reactome pathway
n/an/a>1.00E+5n/an/an/an/an/an/a
National Health Research Institutes
Assay Description
The enzyme activity resulted in the liberation of free pNA at 405 nm. Reaction progress was monitored using a Molecular Devices SpectraMax Plus micro...
Bioorg Med Chem Lett 15: 687-91 (2005)
Article DOI: 10.1016/j.bmcl.2004.11.023
BindingDB Entry DOI: 10.7270/Q2XG9PDW