BDBM1222 2-Aminobenzyl-Substituted AHPPA deriv. 40::benzyl N-[(1S)-1-{[(2S,3R,4R)-4-{[(4-ethoxyphenyl)methyl]amino}-3-hydroxy-4-{[(1S,2R)-2-hydroxy-2,3-dihydro-1H-inden-1-yl]carbamoyl}-1-phenylbutan-2-yl]carbamoyl}-2,2-dimethylpropyl]carbamate
SMILES: CCOc1ccc(CN[C@H]([C@H](O)[C@H](Cc2ccccc2)NC(=O)[C@@H](NC(=O)OCc2ccccc2)C(C)(C)C)C(=O)N[C@@H]2[C@H](O)Cc3ccccc23)cc1
InChI Key: InChIKey=MMLXJDVPKNROEJ-XMBNWINWSA-N
Data: 2 KI  1 IC50
Activity Spreadsheet -- Enzyme Inhibition Constant Data from BindingDB
Found 2 hits for monomerid = 1222
Trg + Lig
Ki
nM
ΔG°
kcal/mole
IC50
nM
Kd
nM
EC50/IC50
nM
koff
s-1
kon
M-1s-1
pHTemp
°C
HIV-1 Protease
(Human immunodeficiency virus type 1)
BDBM1222
(2-Aminobenzyl-Substituted AHPPA deriv. 40 | benzyl...)
Show SMILES CCOc1ccc(CN[C@H]([C@H](O)[C@H](Cc2ccccc2)NC(=O)[C@@H](NC(=O)OCc2ccccc2)C(C)(C)C)C(=O)N[C@@H]2[C@H](O)Cc3ccccc23)cc1 |r|
Show InChI InChI=1S/C43H52N4O7/c1-5-53-32-22-20-29(21-23-32)26-44-37(40(50)46-36-33-19-13-12-18-31(33)25-35(36)48)38(49)34(24-28-14-8-6-9-15-28)45-41(51)39(43(2,3)4)47-42(52)54-27-30-16-10-7-11-17-30/h6-23,34-39,44,48-49H,5,24-27H2,1-4H3,(H,45,51)(H,46,50)(H,47,52)/t34-,35+,36-,37+,38+,39+/m0/s1
9.90n/a 256n/an/an/an/an/an/a
Sandoz Research Institute
Assay Description
Enzymatic activity was measured by following cleavage of the substrate H-Lys-Ala-Arg-Val-Leu-pNph-Glu-Ala-Nle-NH2. Products of the cleavage reaction ...
J Med Chem 39: 2060-7 (1996)
Article DOI: 10.1021/jm9508696
BindingDB Entry DOI: 10.7270/Q2VT1Q89
Human immunodeficiency virus type 1 protease
(Human immunodeficiency virus type 1)
BDBM1222
(2-Aminobenzyl-Substituted AHPPA deriv. 40 | benzyl...)
Show SMILES CCOc1ccc(CN[C@H]([C@H](O)[C@H](Cc2ccccc2)NC(=O)[C@@H](NC(=O)OCc2ccccc2)C(C)(C)C)C(=O)N[C@@H]2[C@H](O)Cc3ccccc23)cc1 |r|
Show InChI InChI=1S/C43H52N4O7/c1-5-53-32-22-20-29(21-23-32)26-44-37(40(50)46-36-33-19-13-12-18-31(33)25-35(36)48)38(49)34(24-28-14-8-6-9-15-28)45-41(51)39(43(2,3)4)47-42(52)54-27-30-16-10-7-11-17-30/h6-23,34-39,44,48-49H,5,24-27H2,1-4H3,(H,45,51)(H,46,50)(H,47,52)/t34-,35+,36-,37+,38+,39+/m0/s1
10n/an/an/an/an/an/an/an/a
SANDOZ Forschungsinstitut Ges. m.b.H
Curated by ChEMBL
Assay Description
Inhibitory activity was determined against HIV type 1 protease
J Med Chem 38: 4917-28 (1996)
BindingDB Entry DOI: 10.7270/Q2FX7BN8