BDBM122318 US8729113, 30
SMILES: NC1=N[C@@H](CCC2(CC2)c2ccc(Cl)cc2)CO1
InChI Key: InChIKey=DKBKVVQJRQSRCV-LBPRGKRZSA-N
Data: 1 KI
Activity Spreadsheet -- Enzyme Inhibition Constant Data from BindingDB
Found 1 hit for monomerid = 122318
Trg + Lig
Ki
nM
ΔG°
kcal/mole
IC50
nM
Kd
nM
EC50/IC50
nM
koff
s-1
kon
M-1s-1
pHTemp
°C
Trace amine-associated receptor 1 (TAAR1)
(Mus musculus (Mouse))
BDBM122318
(US8729113, 30)
Show SMILES NC1=N[C@@H](CCC2(CC2)c2ccc(Cl)cc2)CO1 |r,t:1|
Show InChI InChI=1S/C14H17ClN2O/c15-11-3-1-10(2-4-11)14(7-8-14)6-5-12-9-18-13(16)17-12/h1-4,12H,5-9H2,(H2,16,17)/t12-/m0/s1
Reactome pathway
US Patent
0.400 -11.9n/an/an/an/an/an/a4
Hoffmann-La Roche Inc.
US Patent
Assay Description
Binding assay was performed at 4 C. in a final volume of 1 ml, and with an incubation time of 30 min. The radioligand [3H]-rac-2-(1,2,3,4-tetrahydro-...
US Patent US8729113 (2014)
BindingDB Entry DOI: 10.7270/Q20Z71ZW