BDBM12241 AZD0530 analogue 19::N-(5-chloro-2H-1,3-benzodioxol-4-yl)-5-(oxan-4-yloxy)-7-[2-(pyridin-4-yloxy)ethoxy]quinazolin-4-amine dihydrochloride
SMILES: Clc1ccc2OCOc2c1Nc1ncnc2cc(OCCOc3ccncc3)cc(OC3CCOCC3)c12
InChI Key: InChIKey=UUUXOMVMDSIRMB-UHFFFAOYSA-N
Data: 2 IC50
PDB links: 1 PDB ID contains inhibitors having a similarity of 90% to this monomer.
Activity Spreadsheet -- Enzyme Inhibition Constant Data from BindingDB
Found 2 hits for monomerid = 12241
Trg + Lig
Ki
nM
ΔG°
kcal/mole
IC50
nM
Kd
nM
EC50/IC50
nM
koff
s-1
kon
M-1s-1
pHTemp
°C
Vascular endothelial growth factor receptor 2
(Homo sapiens (Human))
BDBM12241
(AZD0530 analogue 19 | N-(5-chloro-2H-1,3-benzodiox...)
Show SMILES Clc1ccc2OCOc2c1Nc1ncnc2cc(OCCOc3ccncc3)cc(OC3CCOCC3)c12
Show InChI InChI=1S/C27H25ClN4O6/c28-20-1-2-22-26(37-16-36-22)25(20)32-27-24-21(30-15-31-27)13-19(14-23(24)38-18-5-9-33-10-6-18)35-12-11-34-17-3-7-29-8-4-17/h1-4,7-8,13-15,18H,5-6,9-12,16H2,(H,30,31,32)
NCI pathway
Reactome pathway
n/an/a>5.00E+3n/an/an/an/an/an/a
AstraZeneca
Assay Description
An ELISA assay was used to determine the ability of inhibitor to inhibit VEGF-R RTK activity. The compounds were incubated with enzyme 20 min at room...
J Med Chem 49: 6465-88 (2006)
Article DOI: 10.1021/jm060434q
BindingDB Entry DOI: 10.7270/Q2J67F5X
Proto-oncogene tyrosine-protein kinase Src
(Homo sapiens (Human))
BDBM12241
(AZD0530 analogue 19 | N-(5-chloro-2H-1,3-benzodiox...)
Show SMILES Clc1ccc2OCOc2c1Nc1ncnc2cc(OCCOc3ccncc3)cc(OC3CCOCC3)c12
Show InChI InChI=1S/C27H25ClN4O6/c28-20-1-2-22-26(37-16-36-22)25(20)32-27-24-21(30-15-31-27)13-19(14-23(24)38-18-5-9-33-10-6-18)35-12-11-34-17-3-7-29-8-4-17/h1-4,7-8,13-15,18H,5-6,9-12,16H2,(H,30,31,32)
n/an/a 3n/an/an/an/an/an/a
AstraZeneca
Assay Description
This assay determines the ability of test compounds to inhibit Src kinase activity that catalyzes the transfer of the terminal phosphate to the immob...
J Med Chem 49: 6465-88 (2006)
Article DOI: 10.1021/jm060434q
BindingDB Entry DOI: 10.7270/Q2J67F5X