BDBM122418 US8729078, I-28
SMILES: Cn1ccc(Nc2nn(cc2C(N)=O)-c2cccc(c2CO)-n2ncc3cc(cc(F)c3c2=O)C(C)(C)C)n1
InChI Key: InChIKey=FULDDBKJNGHNHW-UHFFFAOYSA-N
Data: 1 IC50
Activity Spreadsheet -- Enzyme Inhibition Constant Data from BindingDB
Found 1 hit for monomerid = 122418
Trg + Lig
Ki
nM
ΔG°
kcal/mole
IC50
nM
Kd
nM
EC50/IC50
nM
koff
s-1
kon
M-1s-1
pHTemp
°C
Tyrosine-protein kinase BTK
(Homo sapiens (Human))
BDBM122418
(US8729078, I-28)
Show SMILES Cn1ccc(Nc2nn(cc2C(N)=O)-c2cccc(c2CO)-n2ncc3cc(cc(F)c3c2=O)C(C)(C)C)n1
Show InChI InChI=1S/C27H27FN8O3/c1-27(2,3)16-10-15-12-30-36(26(39)23(15)19(28)11-16)21-7-5-6-20(18(21)14-37)35-13-17(24(29)38)25(33-35)31-22-8-9-34(4)32-22/h5-13,37H,14H2,1-4H3,(H2,29,38)(H,31,32,33)
NCI pathway
Reactome pathway
US Patent
n/an/a 0.220n/an/an/an/a7.2n/a
Hoffmann-La Roche Inc.
US Patent
Assay Description
Plates assayed are 96-well polypropylene (Greiner) and 96-well 1.2 μm hydrophilic PVDF filter plates (Millipore). Concentrations reported here a...
US Patent US8729078 (2014)
BindingDB Entry DOI: 10.7270/Q2W66JGX