null
SMILES: CC(C)(C)c1cc(F)c2c(cnn(-c3cccc(c3CO)-n3cc(C(N)=O)c(Nc4ccc(cn4)C(F)(F)F)n3)c2=O)c1
InChI Key: InChIKey=YKLGPENWGZKLNP-UHFFFAOYSA-N
Activity Spreadsheet -- Enzyme Inhibition Constant Data from BindingDB
Found 1 hit for monomerid = 122422
Trg + Lig
Ki
nM
ΔG°
kcal/mole
IC50
nM
Kd
nM
EC50/IC50
nM
koff
s-1
kon
M-1s-1
pHTemp
°C
Tyrosine-protein kinase BTK
(Homo sapiens (Human))
BDBM122422
(US8729078, I-32)
Show SMILES CC(C)(C)c1cc(F)c2c(cnn(-c3cccc(c3CO)-n3cc(C(N)=O)c(Nc4ccc(cn4)C(F)(F)F)n3)c2=O)c1
Show InChI InChI=1S/C29H25F4N7O3/c1-28(2,3)17-9-15-11-36-40(27(43)24(15)20(30)10-17)22-6-4-5-21(19(22)14-41)39-13-18(25(34)42)26(38-39)37-23-8-7-16(12-35-23)29(31,32)33/h4-13,41H,14H2,1-3H3,(H2,34,42)(H,35,37,38)
NCI pathway
Reactome pathway
US Patent
n/an/a 0.570n/an/an/an/a7.2n/a
Hoffmann-La Roche Inc.
US Patent
Assay Description
Plates assayed are 96-well polypropylene (Greiner) and 96-well 1.2 μm hydrophilic PVDF filter plates (Millipore). Concentrations reported here a...
US Patent US8729078 (2014)
BindingDB Entry DOI: 10.7270/Q2W66JGX