BDBM122451 US8729074, 8
SMILES: Fc1ccc(cc1)S(=O)(=O)Nc1cc(cnc1Cl)-c1cnc2ccc(cn12)-c1cccnc1
InChI Key: InChIKey=AXRRYQQSRRBWPJ-UHFFFAOYSA-N
Data: 1 KI  2 IC50
Activity Spreadsheet -- Enzyme Inhibition Constant Data from BindingDB
Found 2 hits for monomerid = 122451
Trg + Lig
Ki
nM
ΔG°
kcal/mole
IC50
nM
Kd
nM
EC50/IC50
nM
koff
s-1
kon
M-1s-1
pHTemp
°C
Phosphatidylinositol 4,5-bisphosphate 3-kinase catalytic subunit alpha isoform
(Homo sapiens (Human))
BDBM122451
(US8729074, 8)
Show SMILES Fc1ccc(cc1)S(=O)(=O)Nc1cc(cnc1Cl)-c1cnc2ccc(cn12)-c1cccnc1
Show InChI InChI=1S/C23H15ClFN5O2S/c24-23-20(29-33(31,32)19-6-4-18(25)5-7-19)10-17(12-28-23)21-13-27-22-8-3-16(14-30(21)22)15-2-1-9-26-11-15/h1-14,29H
NCI pathway
Reactome pathway
US Patent
1n/a 4n/an/an/an/an/an/a
Amgen Inc.
US Patent
Assay Description
The PI3K AlphaScreen assay (PerkinElmer, Waltham, Mass.) measures the activity of a panel of four phosphoinositide 3-kinases: PI3Kα, PI3Kβ,...
US Patent US8729074 (2014)
BindingDB Entry DOI: 10.7270/Q2RJ4H4G
Serine/threonine-protein kinase mTOR
(Homo sapiens (Human))
BDBM122451
(US8729074, 8)
Show SMILES Fc1ccc(cc1)S(=O)(=O)Nc1cc(cnc1Cl)-c1cnc2ccc(cn12)-c1cccnc1
Show InChI InChI=1S/C23H15ClFN5O2S/c24-23-20(29-33(31,32)19-6-4-18(25)5-7-19)10-17(12-28-23)21-13-27-22-8-3-16(14-30(21)22)15-2-1-9-26-11-15/h1-14,29H
NCI pathway
Reactome pathway
US Patent
n/an/a 32n/an/an/an/an/an/a
Amgen Inc.
US Patent
Assay Description
The Invitrogen (Carlsbad, Calif.) mammalian target of rapamycin (mTOR) Lanthascreen assay can be used to quantitate mTOR kinase activity in an in vit...
US Patent US8729074 (2014)
BindingDB Entry DOI: 10.7270/Q2RJ4H4G