null
SMILES: COc1cc(cnc1OC)-c1cnc2ccc(cn12)N1[C@H](Cc2ccccc2)COC1=O
InChI Key: InChIKey=FWFTZKCIRBSVCS-LJQANCHMSA-N
Activity Spreadsheet -- Enzyme Inhibition Constant Data from BindingDB
Found 2 hits for monomerid = 122456
Trg + Lig
Ki
nM
ΔG°
kcal/mole
IC50
nM
Kd
nM
EC50/IC50
nM
koff
s-1
kon
M-1s-1
pHTemp
°C
Phosphatidylinositol 4,5-bisphosphate 3-kinase catalytic subunit alpha isoform
(Homo sapiens (Human))
BDBM122456
(US8729074, 14)
Show SMILES COc1cc(cnc1OC)-c1cnc2ccc(cn12)N1[C@H](Cc2ccccc2)COC1=O |r|
Show InChI InChI=1S/C24H22N4O4/c1-30-21-11-17(12-26-23(21)31-2)20-13-25-22-9-8-18(14-27(20)22)28-19(15-32-24(28)29)10-16-6-4-3-5-7-16/h3-9,11-14,19H,10,15H2,1-2H3/t19-/m1/s1
NCI pathway
Reactome pathway
US Patent
268n/an/an/an/an/an/an/an/a
Amgen Inc.
US Patent
Assay Description
The PI3K AlphaScreen assay (PerkinElmer, Waltham, Mass.) measures the activity of a panel of four phosphoinositide 3-kinases: PI3Kα, PI3Kβ,...
US Patent US8729074 (2014)
BindingDB Entry DOI: 10.7270/Q2RJ4H4G
Serine/threonine-protein kinase mTOR
(Homo sapiens (Human))
BDBM122456
(US8729074, 14)
Show SMILES COc1cc(cnc1OC)-c1cnc2ccc(cn12)N1[C@H](Cc2ccccc2)COC1=O |r|
Show InChI InChI=1S/C24H22N4O4/c1-30-21-11-17(12-26-23(21)31-2)20-13-25-22-9-8-18(14-27(20)22)28-19(15-32-24(28)29)10-16-6-4-3-5-7-16/h3-9,11-14,19H,10,15H2,1-2H3/t19-/m1/s1
NCI pathway
Reactome pathway
US Patent
n/an/a 5.10E+3n/an/an/an/an/an/a
Amgen Inc.
US Patent
Assay Description
The Invitrogen (Carlsbad, Calif.) mammalian target of rapamycin (mTOR) Lanthascreen assay can be used to quantitate mTOR kinase activity in an in vit...
US Patent US8729074 (2014)
BindingDB Entry DOI: 10.7270/Q2RJ4H4G