null
SMILES: CCCC(NC(=O)[C@@H]1[C@@H]2[C@H](CN1C(=O)[C@@H](NC(=O)OC(C)(C)C)C1CCCCC1)C2(C)C)C(=O)C(=O)NCC(=O)NCc1ccccc1
InChI Key: InChIKey=FQWQFMJDELOUET-JFLFQVESSA-N
PDB links: 1 PDB ID contains inhibitors having a similarity of 90% to this monomer.
Activity Spreadsheet -- Enzyme Inhibition Constant Data from BindingDB
Found 1 hit for monomerid = 12267
Trg + Lig
Ki
nM
ΔG°
kcal/mole
IC50
nM
Kd
nM
EC50/IC50
nM
koff
s-1
kon
M-1s-1
pHTemp
°C
Genome polyprotein
(Hepatitis C virus (HCV genotype 1a, isolate H))
BDBM12267
(1,1-Dimethylethyl-[1(S)-cyclohexyl-2-[(1R,5S)-6,6-...)
Show SMILES CCCC(NC(=O)[C@@H]1[C@@H]2[C@H](CN1C(=O)[C@@H](NC(=O)OC(C)(C)C)C1CCCCC1)C2(C)C)C(=O)C(=O)NCC(=O)NCc1ccccc1 |r|
Show InChI InChI=1S/C36H53N5O7/c1-7-14-25(30(43)32(45)38-20-26(42)37-19-22-15-10-8-11-16-22)39-31(44)29-27-24(36(27,5)6)21-41(29)33(46)28(23-17-12-9-13-18-23)40-34(47)48-35(2,3)4/h8,10-11,15-16,23-25,27-29H,7,9,12-14,17-21H2,1-6H3,(H,37,42)(H,38,45)(H,39,44)(H,40,47)/t24-,25?,27-,28-,29-/m0/s1
56 -10.1n/an/an/an/an/a6.530
Schering-Plough Research Institute
Assay Description
Proteolytic cleavage of the ester linkage between the Nva (L-norvaline) and the chromophore (PAP) was monitored for change in absorbance at 370 nm. I...
J Med Chem 49: 6074-86 (2006)
Article DOI: 10.1021/jm060325b
BindingDB Entry DOI: 10.7270/Q2DF6PF6