BDBM12287 SCH 491762::tert-butyl N-[(1S)-2-[(1R,2S,5S)-2-[(1-carbamoyl-3-cyclobutyl-1-oxopropan-2-yl)carbamoyl]-6,6-dimethyl-3-azabicyclo[3.1.0]hexan-3-yl]-1-cyclohexyl-2-oxoethyl]carbamate
SMILES: CC(C)(C)OC(=O)N[C@@H](C1CCCCC1)C(=O)N1C[C@H]2[C@@H]([C@H]1C(=O)NC(CC1CCC1)C(=O)C(N)=O)C2(C)C
InChI Key: InChIKey=LFKITAOQQDIAJF-USSJPZKSSA-N
Data: 2 KI
PDB links: 1 PDB ID matches this monomer. 1 PDB ID contains inhibitors having a similarity of 90% to this monomer.
Activity Spreadsheet -- Enzyme Inhibition Constant Data from BindingDB
Found 2 hits for monomerid = 12287
Trg + Lig
Ki
nM
ΔG°
kcal/mole
IC50
nM
Kd
nM
EC50/IC50
nM
koff
s-1
kon
M-1s-1
pHTemp
°C
HCV NS3-NS4A Serine Proteinase
(Hepatitis C virus (HCV genotype 1a, isolate H))
BDBM12287
(SCH 491762 | tert-butyl N-[(1S)-2-[(1R,2S,5S)-2-[(...)
Show SMILES CC(C)(C)OC(=O)N[C@@H](C1CCCCC1)C(=O)N1C[C@H]2[C@@H]([C@H]1C(=O)NC(CC1CCC1)C(=O)C(N)=O)C2(C)C |r|
Show InChI InChI=1S/C29H46N4O6/c1-28(2,3)39-27(38)32-21(17-12-7-6-8-13-17)26(37)33-15-18-20(29(18,4)5)22(33)25(36)31-19(23(34)24(30)35)14-16-10-9-11-16/h16-22H,6-15H2,1-5H3,(H2,30,35)(H,31,36)(H,32,38)/t18-,19?,20-,21-,22-/m0/s1
8n/an/an/an/an/an/an/an/a
Schering-Plough Research Institute
Assay Description
Proteolytic cleavage of the ester linkage between the Nva (L-norvaline) and the chromophore (PAP) was monitored for change in absorbance at 370 nm. I...
J Med Chem 49: 6074-86 (2006)
Article DOI: 10.1021/jm060325b
BindingDB Entry DOI: 10.7270/Q2DF6PF6
3D
3D Structure (crystal)
HCV NS3-NS4A Serine Proteinase
(Hepatitis C virus (HCV genotype 1a, isolate H))
BDBM12287
(SCH 491762 | tert-butyl N-[(1S)-2-[(1R,2S,5S)-2-[(...)
Show SMILES CC(C)(C)OC(=O)N[C@@H](C1CCCCC1)C(=O)N1C[C@H]2[C@@H]([C@H]1C(=O)NC(CC1CCC1)C(=O)C(N)=O)C2(C)C |r|
Show InChI InChI=1S/C29H46N4O6/c1-28(2,3)39-27(38)32-21(17-12-7-6-8-13-17)26(37)33-15-18-20(29(18,4)5)22(33)25(36)31-19(23(34)24(30)35)14-16-10-9-11-16/h16-22H,6-15H2,1-5H3,(H2,30,35)(H,31,36)(H,32,38)/t18-,19?,20-,21-,22-/m0/s1
15 -10.8n/an/an/an/an/a6.530
Schering-Plough Research Institute
Assay Description
Proteolytic cleavage of the ester linkage between the Nva (L-norvaline) and the chromophore (PAP) was monitored for change in absorbance at 370 nm. I...
J Med Chem 50: 2310-8 (2007)
Article DOI: 10.1021/jm060173k
BindingDB Entry DOI: 10.7270/Q27D2SDK
3D
3D Structure (crystal)