BDBM12297 1,1-Dimethylethyl-[1(S)-[[(1R,5S)-2(S)-[[[3-amino-1-(cyclopropylmethyl)-2,3-dioxopropyl]amino]carbonyl]-6,6-dimethyl-3-azabicyclo[3.1.0]hexan-3-yl]carbonyl]-2,2-dimethylpropyl]carbamates::SCH 476776::tert-butyl N-[(2S)-1-[(1R,2S,5S)-2-[(1-carbamoyl-3-cyclopropyl-1-oxopropan-2-yl)carbamoyl]-6,6-dimethyl-3-azabicyclo[3.1.0]hexan-3-yl]-3,3-dimethyl-1-oxobutan-2-yl]carbamate
SMILES: CC(C)(C)OC(=O)N[C@H](C(=O)N1C[C@H]2[C@@H]([C@H]1C(=O)NC(CC1CC1)C(=O)C(N)=O)C2(C)C)C(C)(C)C
InChI Key: InChIKey=YSAPFUUTPOKROX-TZPCIBBBSA-N
Data: 2 KI
PDB links: 1 PDB ID matches this monomer. 1 PDB ID contains this monomer as substructures. 1 PDB ID contains inhibitors having a similarity of 90% to this monomer.
Activity Spreadsheet -- Enzyme Inhibition Constant Data from BindingDB
Found 2 hits for monomerid = 12297
Trg + Lig
Ki
nM
ΔG°
kcal/mole
IC50
nM
Kd
nM
EC50/IC50
nM
koff
s-1
kon
M-1s-1
pHTemp
°C
Genome polyprotein
(Hepatitis C virus (HCV genotype 1a, isolate H))
BDBM12297
(1,1-Dimethylethyl-[1(S)-[[(1R,5S)-2(S)-[[[3-amino-...)
Show SMILES CC(C)(C)OC(=O)N[C@H](C(=O)N1C[C@H]2[C@@H]([C@H]1C(=O)NC(CC1CC1)C(=O)C(N)=O)C2(C)C)C(C)(C)C |r|
Show InChI InChI=1S/C26H42N4O6/c1-24(2,3)19(29-23(35)36-25(4,5)6)22(34)30-12-14-16(26(14,7)8)17(30)21(33)28-15(11-13-9-10-13)18(31)20(27)32/h13-17,19H,9-12H2,1-8H3,(H2,27,32)(H,28,33)(H,29,35)/t14-,15?,16-,17-,19+/m0/s1
57 -10.0n/an/an/an/an/a6.530
Schering-Plough Research Institute
Assay Description
Proteolytic cleavage of the ester linkage between the Nva (L-norvaline) and the chromophore (PAP) was monitored for change in absorbance at 370 nm. I...
J Med Chem 50: 2310-8 (2007)
Article DOI: 10.1021/jm060173k
BindingDB Entry DOI: 10.7270/Q27D2SDK
3D
3D Structure (crystal)
Genome polyprotein
(Hepatitis C virus (HCV genotype 1a, isolate H))
BDBM12297
(1,1-Dimethylethyl-[1(S)-[[(1R,5S)-2(S)-[[[3-amino-...)
Show SMILES CC(C)(C)OC(=O)N[C@H](C(=O)N1C[C@H]2[C@@H]([C@H]1C(=O)NC(CC1CC1)C(=O)C(N)=O)C2(C)C)C(C)(C)C |r|
Show InChI InChI=1S/C26H42N4O6/c1-24(2,3)19(29-23(35)36-25(4,5)6)22(34)30-12-14-16(26(14,7)8)17(30)21(33)28-15(11-13-9-10-13)18(31)20(27)32/h13-17,19H,9-12H2,1-8H3,(H2,27,32)(H,28,33)(H,29,35)/t14-,15?,16-,17-,19+/m0/s1
57n/an/an/an/an/an/an/an/a
Schering-Plough Research Institute
Assay Description
Proteolytic cleavage of the ester linkage between the Nva (L-norvaline) and the chromophore (PAP) was monitored for change in absorbance at 370 nm. I...
J Med Chem 49: 6074-86 (2006)
Article DOI: 10.1021/jm060325b
BindingDB Entry DOI: 10.7270/Q2DF6PF6
3D
3D Structure (crystal)