BDBM122984 US8742158, EX. 10
SMILES: COC(=O)N[C@@H](C(c1ccccc1)c1ccccc1)C(=O)NCCCCC(N(CC(C)C)S(=O)(=O)c1ccc(N)cc1)C(N)=O
InChI Key: InChIKey=MHWPVVNPUFZBSG-TXDWVUBVSA-N
Data: 1 IC50
Activity Spreadsheet -- Enzyme Inhibition Constant Data from BindingDB
Found 1 hit for monomerid = 122984
Trg + Lig
Ki
nM
ΔG°
kcal/mole
IC50
nM
Kd
nM
EC50/IC50
nM
koff
s-1
kon
M-1s-1
pHTemp
°C
HIV-1 protease
(Human immunodeficiency virus)
BDBM122984
(US8742158, EX. 10)
Show SMILES COC(=O)N[C@@H](C(c1ccccc1)c1ccccc1)C(=O)NCCCCC(N(CC(C)C)S(=O)(=O)c1ccc(N)cc1)C(N)=O |r|
Show InChI InChI=1S/C33H43N5O6S/c1-23(2)22-38(45(42,43)27-19-17-26(34)18-20-27)28(31(35)39)16-10-11-21-36-32(40)30(37-33(41)44-3)29(24-12-6-4-7-13-24)25-14-8-5-9-15-25/h4-9,12-15,17-20,23,28-30H,10-11,16,21-22,34H2,1-3H3,(H2,35,39)(H,36,40)(H,37,41)/t28?,30-/m0/s1
US Patent
n/an/a 1.08n/an/an/an/an/an/a
TaiMed Biologies, Inc.
US Patent
Assay Description
This is a fluorometric assay based on the cleavage by protease of a substrate carrying a donor group (EDANS) and an acceptor group (DABCYL) on each s...
US Patent US8742158 (2014)
BindingDB Entry DOI: 10.7270/Q27H1H7P