BDBM122985 US8742158, EX. 44
SMILES: CC(C)CN([C@H](CO)CCCCNC(=O)[C@H](Cc1ccccc1Br)NC(=O)c1cnccn1)S(=O)(=O)c1ccc(N)cc1
InChI Key: InChIKey=WXVIHUMJAOKCFL-IGKIAQTJSA-N
Data: 1 IC50
Activity Spreadsheet -- Enzyme Inhibition Constant Data from BindingDB
Found 1 hit for monomerid = 122985
Trg + Lig
Ki
nM
ΔG°
kcal/mole
IC50
nM
Kd
nM
EC50/IC50
nM
koff
s-1
kon
M-1s-1
pHTemp
°C
HIV-1 protease
(Human immunodeficiency virus)
BDBM122985
(US8742158, EX. 44)
Show SMILES CC(C)CN([C@H](CO)CCCCNC(=O)[C@H](Cc1ccccc1Br)NC(=O)c1cnccn1)S(=O)(=O)c1ccc(N)cc1 |r|
Show InChI InChI=1S/C30H39BrN6O5S/c1-21(2)19-37(43(41,42)25-12-10-23(32)11-13-25)24(20-38)8-5-6-14-35-29(39)27(17-22-7-3-4-9-26(22)31)36-30(40)28-18-33-15-16-34-28/h3-4,7,9-13,15-16,18,21,24,27,38H,5-6,8,14,17,19-20,32H2,1-2H3,(H,35,39)(H,36,40)/t24-,27-/m0/s1
US Patent
n/an/a 0.471n/an/an/an/an/an/a
TaiMed Biologies, Inc.
US Patent
Assay Description
This is a fluorometric assay based on the cleavage by protease of a substrate carrying a donor group (EDANS) and an acceptor group (DABCYL) on each s...
US Patent US8742158 (2014)
BindingDB Entry DOI: 10.7270/Q27H1H7P