BDBM123013 US8742158, EX 24
SMILES: COC(=O)N[C@@H](CC1CCCCC1)C(=O)NCCCC[C@@H](CO)N(CC(C)C)S(=O)(=O)c1ccc(N)cc1
InChI Key: InChIKey=MUGPCJSECROUMS-ZCYQVOJMSA-N
Data: 1 IC50
Activity Spreadsheet -- Enzyme Inhibition Constant Data from BindingDB
Found 1 hit for monomerid = 123013
Trg + Lig
Ki
nM
ΔG°
kcal/mole
IC50
nM
Kd
nM
EC50/IC50
nM
koff
s-1
kon
M-1s-1
pHTemp
°C
HIV-1 protease
(Human immunodeficiency virus)
BDBM123013
(US8742158, EX 24)
Show SMILES COC(=O)N[C@@H](CC1CCCCC1)C(=O)NCCCC[C@@H](CO)N(CC(C)C)S(=O)(=O)c1ccc(N)cc1 |r|
Show InChI InChI=1S/C27H46N4O6S/c1-20(2)18-31(38(35,36)24-14-12-22(28)13-15-24)23(19-32)11-7-8-16-29-26(33)25(30-27(34)37-3)17-21-9-5-4-6-10-21/h12-15,20-21,23,25,32H,4-11,16-19,28H2,1-3H3,(H,29,33)(H,30,34)/t23-,25-/m0/s1
US Patent
n/an/a 5.21n/an/an/an/an/an/a
TaiMed Biologies, Inc.
US Patent
Assay Description
This is a fluorometric assay based on the cleavage by protease of a substrate carrying a donor group (EDANS) and an acceptor group (DABCYL) on each s...
US Patent US8742158 (2014)
BindingDB Entry DOI: 10.7270/Q27H1H7P