null
SMILES: CC(C)CN([C@H](CO)CCCCNC(=O)[C@H](CC1CCCCC1)NC(=O)c1ccc(C)nc1)S(=O)(=O)c1ccc(N)cc1
InChI Key: InChIKey=JJSAKJLNMPHIKK-JDXGNMNLSA-N
Activity Spreadsheet -- Enzyme Inhibition Constant Data from BindingDB
Found 1 hit for monomerid = 123015
Trg + Lig
Ki
nM
ΔG°
kcal/mole
IC50
nM
Kd
nM
EC50/IC50
nM
koff
s-1
kon
M-1s-1
pHTemp
°C
Gag-Pol polyprotein [489-587,G537V,H558K,V571A]
(Human immunodeficiency virus)
BDBM123015
(US8742158, EX 26)
Show SMILES CC(C)CN([C@H](CO)CCCCNC(=O)[C@H](CC1CCCCC1)NC(=O)c1ccc(C)nc1)S(=O)(=O)c1ccc(N)cc1 |r|
Show InChI InChI=1S/C32H49N5O5S/c1-23(2)21-37(43(41,42)29-16-14-27(33)15-17-29)28(22-38)11-7-8-18-34-32(40)30(19-25-9-5-4-6-10-25)36-31(39)26-13-12-24(3)35-20-26/h12-17,20,23,25,28,30,38H,4-11,18-19,21-22,33H2,1-3H3,(H,34,40)(H,36,39)/t28-,30-/m0/s1
US Patent
n/an/a 3.31n/an/an/an/an/an/a
TaiMed Biologies, Inc.
US Patent
Assay Description
This is a fluorometric assay based on the cleavage by protease of a substrate carrying a donor group (EDANS) and an acceptor group (DABCYL) on each s...
US Patent US8742158 (2014)
BindingDB Entry DOI: 10.7270/Q27H1H7P