BDBM123117 (R)-2-((4-((5-(tert-butyl)-1-methyl-1H-pyrazol-3-yl)amino)-1H-pyrazolo[3,4-d]pyrimidin-6-yl)amino)-2-(4-methoxyphenyl)ethanol (16)
SMILES: COc1ccc(cc1)[C@H](CO)Nc1nc(Nc2cc(n(C)n2)C(C)(C)C)c2c[nH]nc2n1
InChI Key: InChIKey=CPFBIUZSNDQYBB-INIZCTEOSA-N
Data: 2 IC50
Activity Spreadsheet -- Enzyme Inhibition Constant Data from BindingDB
Found 2 hits for monomerid = 123117
Trg + Lig
Ki
nM
ΔG°
kcal/mole
IC50
nM
Kd
nM
EC50/IC50
nM
koff
s-1
kon
M-1s-1
pHTemp
°C
MurC
(Escherichia coli)
BDBM123117
((R)-2-((4-((5-(tert-butyl)-1-methyl-1H-pyrazol-3-y...)
Show SMILES COc1ccc(cc1)[C@H](CO)Nc1nc(Nc2cc(n(C)n2)C(C)(C)C)c2c[nH]nc2n1
Show InChI InChI=1S/C22H28N8O2/c1-22(2,3)17-10-18(29-30(17)4)25-19-15-11-23-28-20(15)27-21(26-19)24-16(12-31)13-6-8-14(32-5)9-7-13/h6-11,16,31H,12H2,1-5H3,(H3,23,24,25,26,27,28,29)/t16-/m0/s1
n/an/a 21n/an/an/an/an/a25
AstraZeneca India Pvt. Ltd.
Assay Description
The reactions (25 μL) were carried out in 25 mM Tris-HCl pH 8.0, 10 mM ammonium sulfate, 1.25 mM DTT, 0.002% Brij-35, 10 mM MgCl2, 40 μM UN...
ACS Chem Biol 9: 2274-82 (2014)
Article DOI: 10.1021/cb500360c
BindingDB Entry DOI: 10.7270/Q2KS6Q7X
MurC (P. aeruginosa)
(Pseudomonas aeruginosa (G-proteobacteria))
BDBM123117
((R)-2-((4-((5-(tert-butyl)-1-methyl-1H-pyrazol-3-y...)
Show SMILES COc1ccc(cc1)[C@H](CO)Nc1nc(Nc2cc(n(C)n2)C(C)(C)C)c2c[nH]nc2n1
Show InChI InChI=1S/C22H28N8O2/c1-22(2,3)17-10-18(29-30(17)4)25-19-15-11-23-28-20(15)27-21(26-19)24-16(12-31)13-6-8-14(32-5)9-7-13/h6-11,16,31H,12H2,1-5H3,(H3,23,24,25,26,27,28,29)/t16-/m0/s1
n/an/a 4n/an/an/an/an/a25
AstraZeneca India Pvt. Ltd.
Assay Description
The reactions (50 μL) were carried out in 50 mM Tris-HCl pH 8.0, 20 mM ammonium sulfate, 2.5 mM DTT, 0.002% Brij-35, 1 mM MgCl2, 18 μM UNAM...
ACS Chem Biol 9: 2274-82 (2014)
Article DOI: 10.1021/cb500360c
BindingDB Entry DOI: 10.7270/Q2KS6Q7X