null
SMILES: Cc1cc(F)ccc1N=C1CC(=O)C(O1)=Cc1c[nH]c2ncccc12
InChI Key: InChIKey=CIUXINGXNDQWMS-PTHIOARXSA-N
Activity Spreadsheet -- Enzyme Inhibition Constant Data from BindingDB
Found 1 hit for monomerid = 123146
Trg + Lig
Ki
nM
ΔG°
kcal/mole
IC50
nM
Kd
nM
EC50/IC50
nM
koff
s-1
kon
M-1s-1
pHTemp
°C
Cell division cycle 7-related protein kinase
(Homo sapiens (Human))
BDBM123146
(US8742113, 233)
Show SMILES Cc1cc(F)ccc1N=C1CC(=O)C(O1)=Cc1c[nH]c2ncccc12 |w:15.17,8.8|
Show InChI InChI=1S/C19H14FN3O2/c1-11-7-13(20)4-5-15(11)23-18-9-16(24)17(25-18)8-12-10-22-19-14(12)3-2-6-21-19/h2-8,10H,9H2,1H3,(H,21,22)/b17-8-,23-18+
Reactome pathway
US Patent
n/an/a 2n/an/an/an/a7.5n/a
SBI Biotech Co., Ltd.; Carna Biosciences, Inc.
US Patent
Assay Description
Measurement of kinase activity was carried out using an MSA assay kit (QuickScout Screening Assist Kit, Carna Biosciences, Inc.). Assay buffer (20 mM...
US Patent US8742113 (2014)
BindingDB Entry DOI: 10.7270/Q2B856S5