null
SMILES: CCOc1cc(CN2CCC3(CN(C(=O)O3)c3ccc(C(O)=O)c(C)c3)CC2)c(cc1C)-c1ccc(F)c(F)c1F
InChI Key: InChIKey=PEOYNYRRIQYYCO-UHFFFAOYSA-N
Activity Spreadsheet -- Enzyme Inhibition Constant Data from BindingDB
Found 1 hit for monomerid = 123248
Trg + Lig
Ki
nM
ΔG°
kcal/mole
IC50
nM
Kd
nM
EC50/IC50
nM
koff
s-1
kon
M-1s-1
pHTemp
°C
Somatostatin receptor type 5
(Homo sapiens (Human))
BDBM123248
(US8742110, 4-12)
Show SMILES CCOc1cc(CN2CCC3(CN(C(=O)O3)c3ccc(C(O)=O)c(C)c3)CC2)c(cc1C)-c1ccc(F)c(F)c1F
Show InChI InChI=1S/C31H31F3N2O5/c1-4-40-26-15-20(24(14-19(26)3)23-7-8-25(32)28(34)27(23)33)16-35-11-9-31(10-12-35)17-36(30(39)41-31)21-5-6-22(29(37)38)18(2)13-21/h5-8,13-15H,4,9-12,16-17H2,1-3H3,(H,37,38)
Reactome pathway
US Patent
n/an/a 0.188n/an/an/an/a7.8n/a
Merck Sharp & Dohme Corp.
US Patent
Assay Description
SSTR5 binding assays can be performed by labeling somatostatin and determining the ability of a compound to inhibit somatostatin binding. (Poitout et...
US Patent US8742110 (2014)
BindingDB Entry DOI: 10.7270/Q26H4G39