BDBM123277 US8742110, 5-13
SMILES: Cc1cc(CN2CCC3(CN(C(=O)O3)c3ccc(cc3)C(O)=O)CC2)cc2c1OCCC2(C)C
InChI Key: InChIKey=GPPPCEDIJCYKEC-UHFFFAOYSA-N
Data: 1 IC50
Activity Spreadsheet -- Enzyme Inhibition Constant Data from BindingDB
Found 1 hit for monomerid = 123277
Trg + Lig
Ki
nM
ΔG°
kcal/mole
IC50
nM
Kd
nM
EC50/IC50
nM
koff
s-1
kon
M-1s-1
pHTemp
°C
Somatostatin receptor type 5
(Homo sapiens (Human))
BDBM123277
(US8742110, 5-13)
Show SMILES Cc1cc(CN2CCC3(CN(C(=O)O3)c3ccc(cc3)C(O)=O)CC2)cc2c1OCCC2(C)C
Show InChI InChI=1S/C27H32N2O5/c1-18-14-19(15-22-23(18)33-13-10-26(22,2)3)16-28-11-8-27(9-12-28)17-29(25(32)34-27)21-6-4-20(5-7-21)24(30)31/h4-7,14-15H,8-13,16-17H2,1-3H3,(H,30,31)
Reactome pathway
US Patent
n/an/a 0.317n/an/an/an/a7.8n/a
Merck Sharp & Dohme Corp.
US Patent
Assay Description
SSTR5 binding assays can be performed by labeling somatostatin and determining the ability of a compound to inhibit somatostatin binding. (Poitout et...
US Patent US8742110 (2014)
BindingDB Entry DOI: 10.7270/Q26H4G39