BDBM123296 US8742110, 6-14
SMILES: CC(C)n1nc(CN2CCC3(CN(C(=O)O3)c3ccc(cc3)C(O)=O)CC2)c2cc(OCc3ccccc3)ccc12
InChI Key: InChIKey=ARPDSIZWXRYMMA-UHFFFAOYSA-N
Data: 1 IC50
Activity Spreadsheet -- Enzyme Inhibition Constant Data from BindingDB
Found 1 hit for monomerid = 123296
Trg + Lig
Ki
nM
ΔG°
kcal/mole
IC50
nM
Kd
nM
EC50/IC50
nM
koff
s-1
kon
M-1s-1
pHTemp
°C
Somatostatin receptor type 5
(Homo sapiens (Human))
BDBM123296
(US8742110, 6-14)
Show SMILES CC(C)n1nc(CN2CCC3(CN(C(=O)O3)c3ccc(cc3)C(O)=O)CC2)c2cc(OCc3ccccc3)ccc12
Show InChI InChI=1S/C32H34N4O5/c1-22(2)36-29-13-12-26(40-20-23-6-4-3-5-7-23)18-27(29)28(33-36)19-34-16-14-32(15-17-34)21-35(31(39)41-32)25-10-8-24(9-11-25)30(37)38/h3-13,18,22H,14-17,19-21H2,1-2H3,(H,37,38)
Reactome pathway
US Patent
n/an/a 0.260n/an/an/an/a7.8n/a
Merck Sharp & Dohme Corp.
US Patent
Assay Description
SSTR5 binding assays can be performed by labeling somatostatin and determining the ability of a compound to inhibit somatostatin binding. (Poitout et...
US Patent US8742110 (2014)
BindingDB Entry DOI: 10.7270/Q26H4G39