BDBM123556 US8748624, 42
SMILES: OC(=O)CCNC(=O)c1ccc(cn1)-c1cc(ccc1CNc1ccc(c(Cl)c1)-c1ccc(cc1Cl)C(F)(F)F)C(F)(F)F
InChI Key: InChIKey=ZEECXPSTTOCRAS-UHFFFAOYSA-N
Data: 1 KI
Activity Spreadsheet -- Enzyme Inhibition Constant Data from BindingDB
Found 1 hit for monomerid = 123556
Trg + Lig
Ki
nM
ΔG°
kcal/mole
IC50
nM
Kd
nM
EC50/IC50
nM
koff
s-1
kon
M-1s-1
pHTemp
°C
Glucagon receptor
(Homo sapiens (Human))
BDBM123556
(US8748624, 42)
Show SMILES OC(=O)CCNC(=O)c1ccc(cn1)-c1cc(ccc1CNc1ccc(c(Cl)c1)-c1ccc(cc1Cl)C(F)(F)F)C(F)(F)F
Show InChI InChI=1S/C30H21Cl2F6N3O3/c31-24-12-19(30(36,37)38)4-6-21(24)22-7-5-20(13-25(22)32)40-14-16-1-3-18(29(33,34)35)11-23(16)17-2-8-26(41-15-17)28(44)39-10-9-27(42)43/h1-8,11-13,15,40H,9-10,14H2,(H,39,44)(H,42,43)
US Patent
16.5n/an/an/an/an/an/a7.4n/a
Janssen Pharmaceutica NV
US Patent
Assay Description
The binding assay was performed by a filtration method in a 384 well format. Membranes at a final protein concentration of 6 μg/well were incuba...
US Patent US8748624 (2014)
BindingDB Entry DOI: 10.7270/Q29885QP