BDBM123647 US8748624, 170
SMILES: OC(=O)CCNC(=O)c1ccc(cn1)-c1cc(Cl)ccc1CNc1ccc(c(Cl)c1)-c1cccc(c1)C(F)(F)F
InChI Key: InChIKey=GQTPFUGJTODNEB-UHFFFAOYSA-N
Data: 1 KI
Activity Spreadsheet -- Enzyme Inhibition Constant Data from BindingDB
Found 1 hit for monomerid = 123647
Trg + Lig
Ki
nM
ΔG°
kcal/mole
IC50
nM
Kd
nM
EC50/IC50
nM
koff
s-1
kon
M-1s-1
pHTemp
°C
Glucagon receptor
(Homo sapiens (Human))
BDBM123647
(US8748624, 170)
Show SMILES OC(=O)CCNC(=O)c1ccc(cn1)-c1cc(Cl)ccc1CNc1ccc(c(Cl)c1)-c1cccc(c1)C(F)(F)F
Show InChI InChI=1S/C29H22Cl2F3N3O3/c30-21-6-4-18(24(13-21)19-5-9-26(37-16-19)28(40)35-11-10-27(38)39)15-36-22-7-8-23(25(31)14-22)17-2-1-3-20(12-17)29(32,33)34/h1-9,12-14,16,36H,10-11,15H2,(H,35,40)(H,38,39)
US Patent
20.7n/an/an/an/an/an/a7.4n/a
Janssen Pharmaceutica NV
US Patent
Assay Description
The binding assay was performed by a filtration method in a 384 well format. Membranes at a final protein concentration of 6 μg/well were incuba...
US Patent US8748624 (2014)
BindingDB Entry DOI: 10.7270/Q29885QP