BDBM123651 US8748624, 174
SMILES: OC(=O)CCNC(=O)c1ccc(cn1)-c1cc(ccc1CNc1ccc(cc1)-c1ccc(F)cc1)C1=CCCCC1
InChI Key: InChIKey=ZBGUZLNWMIQAEZ-UHFFFAOYSA-N
Data: 1 KI
Activity Spreadsheet -- Enzyme Inhibition Constant Data from BindingDB
Found 1 hit for monomerid = 123651
Trg + Lig
Ki
nM
ΔG°
kcal/mole
IC50
nM
Kd
nM
EC50/IC50
nM
koff
s-1
kon
M-1s-1
pHTemp
°C
Glucagon receptor
(Homo sapiens (Human))
BDBM123651
(US8748624, 174)
Show SMILES OC(=O)CCNC(=O)c1ccc(cn1)-c1cc(ccc1CNc1ccc(cc1)-c1ccc(F)cc1)C1=CCCCC1 |t:39|
Show InChI InChI=1S/C34H32FN3O3/c35-29-13-8-24(9-14-29)25-10-15-30(16-11-25)37-21-27-7-6-26(23-4-2-1-3-5-23)20-31(27)28-12-17-32(38-22-28)34(41)36-19-18-33(39)40/h4,6-17,20,22,37H,1-3,5,18-19,21H2,(H,36,41)(H,39,40)
US Patent
18.3n/an/an/an/an/an/a7.4n/a
Janssen Pharmaceutica NV
US Patent
Assay Description
The binding assay was performed by a filtration method in a 384 well format. Membranes at a final protein concentration of 6 μg/well were incuba...
US Patent US8748624 (2014)
BindingDB Entry DOI: 10.7270/Q29885QP