BDBM123677 US8748618, AI-10-57
SMILES: O=COc1ccc2nc([nH]c2c1)-c1ccccn1
InChI Key: InChIKey=ZBUGDSFQUUHGDU-UHFFFAOYSA-N
Data: 1 IC50
Activity Spreadsheet -- Enzyme Inhibition Constant Data from BindingDB
Found 1 hit for monomerid = 123677
Trg + Lig
Ki
nM
ΔG°
kcal/mole
IC50
nM
Kd
nM
EC50/IC50
nM
koff
s-1
kon
M-1s-1
pHTemp
°C
Core-binding factor subunit beta
(Homo sapiens (Human))
BDBM123677
(US8748618, AI-10-57)
Show SMILES O=COc1ccc2nc([nH]c2c1)-c1ccccn1
Show InChI InChI=1S/C13H9N3O2/c17-8-18-9-4-5-10-12(7-9)16-13(15-10)11-3-1-2-6-14-11/h1-8H,(H,15,16)
US Patent
n/an/a 4.00E+4n/an/an/an/an/an/a
University of Virginia Patent Foundation
US Patent
Assay Description
We have developed effective assays to monitor the inhibition of CBFβ-SMMHC binding to the Runt domain (as well as for CBFβ binding to the R...
US Patent US8748618 (2014)
BindingDB Entry DOI: 10.7270/Q25M64C7