BDBM123753 3-methyl-1-phenyl-1H-pyrazolo[3,4-d]pyrimidin-4-amine (12)
SMILES: Cc1nn(-c2ccccc2)c2ncnc(N)c12
InChI Key: InChIKey=NUJRIFUQIQAKOJ-UHFFFAOYSA-N
Data: 4 IC50
Activity Spreadsheet -- Enzyme Inhibition Constant Data from BindingDB
Found 4 hits for monomerid = 123753
Trg + Lig
Ki
nM
ΔG°
kcal/mole
IC50
nM
Kd
nM
EC50/IC50
nM
koff
s-1
kon
M-1s-1
pHTemp
°C
Phospholipase D (PLD)
(Homo sapiens (Human))
BDBM123753
(3-methyl-1-phenyl-1H-pyrazolo[3,4-d]pyrimidin-4-am...)
Show SMILES Cc1nn(-c2ccccc2)c2ncnc(N)c12
Show InChI InChI=1S/C12H11N5/c1-8-10-11(13)14-7-15-12(10)17(16-8)9-5-3-2-4-6-9/h2-7H,1H3,(H2,13,14,15)
n/an/a 900n/an/an/an/an/a37
University of Massachusetts Boston
Assay Description
PLD enzymes (50 nM) were reconstituted with phospholipid vesicle substrates. All assays were performed at 37 C with agitation for 30 min. Reactions...
Chem Biol Drug Des 84: 270-81 (2014)
Article DOI: 10.1111/cbdd.12319
BindingDB Entry DOI: 10.7270/Q2HT2N05
Phospholipase D (PLD_SC)
(Streptomyces chromofuscus)
BDBM123753
(3-methyl-1-phenyl-1H-pyrazolo[3,4-d]pyrimidin-4-am...)
Show SMILES Cc1nn(-c2ccccc2)c2ncnc(N)c12
Show InChI InChI=1S/C12H11N5/c1-8-10-11(13)14-7-15-12(10)17(16-8)9-5-3-2-4-6-9/h2-7H,1H3,(H2,13,14,15)
n/an/a 900n/an/an/an/a8.0n/a
Roxbury Community College
Assay Description
A NaOH stock solution (50 mM) was standardized with KHP then diluted in Millipore water (10-fold serial dilutions) then used to hold the pH constant ...
Chem Biol Drug Des 87: 714-29 (2016)
Article DOI: 10.1111/cbdd.12705
BindingDB Entry DOI: 10.7270/Q2R78D0V
Phospholipase D (PLD_sp)
(Streptomyces sp. PMF)
BDBM123753
(3-methyl-1-phenyl-1H-pyrazolo[3,4-d]pyrimidin-4-am...)
Show SMILES Cc1nn(-c2ccccc2)c2ncnc(N)c12
Show InChI InChI=1S/C12H11N5/c1-8-10-11(13)14-7-15-12(10)17(16-8)9-5-3-2-4-6-9/h2-7H,1H3,(H2,13,14,15)
n/an/a 1.50E+3n/an/an/an/an/a37
University of Massachusetts Boston
Assay Description
PLD enzymes (50 nM) were reconstituted with phospholipid vesicle substrates. All assays were performed at 37 C with agitation for 30 min. Reactions...
Chem Biol Drug Des 84: 270-81 (2014)
Article DOI: 10.1111/cbdd.12319
BindingDB Entry DOI: 10.7270/Q2HT2N05
Phospholipase D2 (PLD2)
(Homo sapiens (Human))
BDBM123753
(3-methyl-1-phenyl-1H-pyrazolo[3,4-d]pyrimidin-4-am...)
Show SMILES Cc1nn(-c2ccccc2)c2ncnc(N)c12
Show InChI InChI=1S/C12H11N5/c1-8-10-11(13)14-7-15-12(10)17(16-8)9-5-3-2-4-6-9/h2-7H,1H3,(H2,13,14,15)
Reactome pathway
n/an/a 120n/an/an/an/an/a37
University of Massachusetts Boston
Assay Description
PLD enzymes (50 nM) were reconstituted with phospholipid vesicle substrates. All assays were performed at 37 C with agitation for 30 min. Reactions...
Chem Biol Drug Des 84: 270-81 (2014)
Article DOI: 10.1111/cbdd.12319
BindingDB Entry DOI: 10.7270/Q2HT2N05