null
SMILES: CC1(C)OCC(N)=N[C@](C)(c2cc(N[C@H]3CCc4cc(cnc34)C#N)c(F)cc2F)C1(F)F
InChI Key: InChIKey=ZXPMSLQQIPEYLP-HTAPYJJXSA-N
Activity Spreadsheet -- Enzyme Inhibition Constant Data from BindingDB
Found 2 hits for monomerid = 123875
Trg + Lig
Ki
nM
ΔG°
kcal/mole
IC50
nM
Kd
nM
EC50/IC50
nM
koff
s-1
kon
M-1s-1
pHTemp
°C
Beta-secretase 2
(Homo sapiens (Human))
BDBM123875
(US8748418, 20)
Show SMILES CC1(C)OCC(N)=N[C@](C)(c2cc(N[C@H]3CCc4cc(cnc34)C#N)c(F)cc2F)C1(F)F |r,c:6|
Show InChI InChI=1S/C23H23F4N5O/c1-21(2)23(26,27)22(3,32-19(29)11-33-21)14-7-18(16(25)8-15(14)24)31-17-5-4-13-6-12(9-28)10-30-20(13)17/h6-8,10,17,31H,4-5,11H2,1-3H3,(H2,29,32)/t17-,22+/m0/s1
US Patent
n/an/a 170n/an/an/an/a4.5n/a
Hoffmann-La Roche Inc.
US Patent
Assay Description
The FRET assay was performed essentially as described in Gruninger-Leitch et al., Journal of Biological Chemistry (2002) 277(7) 4687-93 (Substrate an...
US Patent US8748418 (2014)
BindingDB Entry DOI: 10.7270/Q2C53JJP
Beta-secretase 1
(Homo sapiens (Human))
BDBM123875
(US8748418, 20)
Show SMILES CC1(C)OCC(N)=N[C@](C)(c2cc(N[C@H]3CCc4cc(cnc34)C#N)c(F)cc2F)C1(F)F |r,c:6|
Show InChI InChI=1S/C23H23F4N5O/c1-21(2)23(26,27)22(3,32-19(29)11-33-21)14-7-18(16(25)8-15(14)24)31-17-5-4-13-6-12(9-28)10-30-20(13)17/h6-8,10,17,31H,4-5,11H2,1-3H3,(H2,29,32)/t17-,22+/m0/s1
US Patent
n/an/a 1.90E+3n/an/an/an/a4.5n/a
Hoffmann-La Roche Inc.
US Patent
Assay Description
The FRET assay was performed essentially as described in Gruninger-Leitch et al., Journal of Biological Chemistry (2002) 277(7) 4687-93 (Substrate an...
US Patent US8748418 (2014)
BindingDB Entry DOI: 10.7270/Q2C53JJP