BDBM123945 US8754233, 2-(5-Amino-3-methyl-1H-pyrazol-4-yl)-5-fluoro-benzothiazole-6-sulfonic acid amide
SMILES: Cc1[nH]nc(N)c1-c1nc2cc(F)c(cc2s1)S(N)(=O)=O
InChI Key: InChIKey=VBUGCZILHWRGPF-UHFFFAOYSA-N
Data: 1 IC50
Activity Spreadsheet -- Enzyme Inhibition Constant Data from BindingDB
Found 1 hit for monomerid = 123945
Trg + Lig
Ki
nM
ΔG°
kcal/mole
IC50
nM
Kd
nM
EC50/IC50
nM
koff
s-1
kon
M-1s-1
pHTemp
°C
Serine/threonine-protein kinase ILK-1
(Homo sapiens (Human))
BDBM123945
(US8754233, 2-(5-Amino-3-methyl-1H-pyrazol-4-yl)-5-...)
Show SMILES Cc1[nH]nc(N)c1-c1nc2cc(F)c(cc2s1)S(N)(=O)=O
Show InChI InChI=1S/C11H10FN5O2S2/c1-4-9(10(13)17-16-4)11-15-6-2-5(12)8(21(14,18)19)3-7(6)20-11/h2-3H,1H3,(H3,13,16,17)(H2,14,18,19)
Reactome pathway
US Patent
n/an/a 7n/an/an/an/an/a40
Dermira (Canada), Inc.
US Patent
Assay Description
5 uL of each compound dilution were robotically pipetted to Costar serocluster plates maintaining the same plate layout. All assay mixtures consisted...
US Patent US8754233 (2014)
BindingDB Entry DOI: 10.7270/Q23N2231