null
SMILES: Cc1[nH]nc(N)c1-c1nc2cc(F)c(cc2s1)S(=O)(=O)NCc1ccncc1
InChI Key: InChIKey=AYMNDSCQMZZEPC-UHFFFAOYSA-N
Activity Spreadsheet -- Enzyme Inhibition Constant Data from BindingDB
Found 1 hit for monomerid = 123947
Trg + Lig
Ki
nM
ΔG°
kcal/mole
IC50
nM
Kd
nM
EC50/IC50
nM
koff
s-1
kon
M-1s-1
pHTemp
°C
Integrin-linked protein kinase
(Homo sapiens (Human))
BDBM123947
(US8754233, 2-(5-Amino-3-methyl-1H-pyrazol-4-yl)-5-...)
Show SMILES Cc1[nH]nc(N)c1-c1nc2cc(F)c(cc2s1)S(=O)(=O)NCc1ccncc1
Show InChI InChI=1S/C17H15FN6O2S2/c1-9-15(16(19)24-23-9)17-22-12-6-11(18)14(7-13(12)27-17)28(25,26)21-8-10-2-4-20-5-3-10/h2-7,21H,8H2,1H3,(H3,19,23,24)
Reactome pathway
US Patent
n/an/a 130n/an/an/an/an/a40
Dermira (Canada), Inc.
US Patent
Assay Description
5 uL of each compound dilution were robotically pipetted to Costar serocluster plates maintaining the same plate layout. All assay mixtures consisted...
US Patent US8754233 (2014)
BindingDB Entry DOI: 10.7270/Q23N2231