null
SMILES: Nc1n[nH]c(CCCO)c1-c1nc2ccccc2s1
InChI Key: InChIKey=XCQLBKAOOFELTK-UHFFFAOYSA-N
Activity Spreadsheet -- Enzyme Inhibition Constant Data from BindingDB
Found 1 hit for monomerid = 123973
Trg + Lig
Ki
nM
ΔG°
kcal/mole
IC50
nM
Kd
nM
EC50/IC50
nM
koff
s-1
kon
M-1s-1
pHTemp
°C
Integrin-linked protein kinase
(Homo sapiens (Human))
BDBM123973
(US8754233, 3-(5-Amino-4-benzothiazol-2-yl-1H-pyraz...)
Show SMILES Nc1n[nH]c(CCCO)c1-c1nc2ccccc2s1
Show InChI InChI=1S/C13H14N4OS/c14-12-11(9(16-17-12)5-3-7-18)13-15-8-4-1-2-6-10(8)19-13/h1-2,4,6,18H,3,5,7H2,(H3,14,16,17)
Reactome pathway
US Patent
n/an/a 200n/an/an/an/an/a40
Dermira (Canada), Inc.
US Patent
Assay Description
5 uL of each compound dilution were robotically pipetted to Costar serocluster plates maintaining the same plate layout. All assay mixtures consisted...
US Patent US8754233 (2014)
BindingDB Entry DOI: 10.7270/Q23N2231