null
SMILES: NCCCc1[nH]nc(N)c1-c1nc2ccccc2s1
InChI Key: InChIKey=YHCLQAVKRVLZRL-UHFFFAOYSA-N
Activity Spreadsheet -- Enzyme Inhibition Constant Data from BindingDB
Found 1 hit for monomerid = 124052
Trg + Lig
Ki
nM
ΔG°
kcal/mole
IC50
nM
Kd
nM
EC50/IC50
nM
koff
s-1
kon
M-1s-1
pHTemp
°C
Integrin-linked protein kinase
(Homo sapiens (Human))
BDBM124052
(US8754233, 5-(3-Amino-propyl)-4-benzothiazol-2-yl-...)
Show SMILES NCCCc1[nH]nc(N)c1-c1nc2ccccc2s1
Show InChI InChI=1S/C13H15N5S/c14-7-3-5-9-11(12(15)18-17-9)13-16-8-4-1-2-6-10(8)19-13/h1-2,4,6H,3,5,7,14H2,(H3,15,17,18)
Reactome pathway
US Patent
n/an/a 10n/an/an/an/an/a40
Dermira (Canada), Inc.
US Patent
Assay Description
5 uL of each compound dilution were robotically pipetted to Costar serocluster plates maintaining the same plate layout. All assay mixtures consisted...
US Patent US8754233 (2014)
BindingDB Entry DOI: 10.7270/Q23N2231