BDBM12409 3-bromo-N-[5-({6-methoxy-7-[3-(morpholin-4-yl)propoxy]quinazolin-4-yl}amino)pyrimidin-2-yl]-4-methylbenzamide::quinazoline deriv. 7
SMILES: COc1cc2c(Nc3cnc(NC(=O)c4ccc(C)c(Br)c4)nc3)ncnc2cc1OCCCN1CCOCC1
InChI Key: InChIKey=QMPOGHCAFNBWOI-UHFFFAOYSA-N
Data: 1 IC50
Activity Spreadsheet -- Enzyme Inhibition Constant Data from BindingDB
Found 1 hit for monomerid = 12409
Trg + Lig
Ki
nM
ΔG°
kcal/mole
IC50
nM
Kd
nM
EC50/IC50
nM
koff
s-1
kon
M-1s-1
pHTemp
°C
Aurora kinase A
(Homo sapiens (Human))
BDBM12409
(3-bromo-N-[5-({6-methoxy-7-[3-(morpholin-4-yl)prop...)
Show SMILES COc1cc2c(Nc3cnc(NC(=O)c4ccc(C)c(Br)c4)nc3)ncnc2cc1OCCCN1CCOCC1
Show InChI InChI=1S/C28H30BrN7O4/c1-18-4-5-19(12-22(18)29)27(37)35-28-30-15-20(16-31-28)34-26-21-13-24(38-2)25(14-23(21)32-17-33-26)40-9-3-6-36-7-10-39-11-8-36/h4-5,12-17H,3,6-11H2,1-2H3,(H,32,33,34)(H,30,31,35,37)
NCI pathway
Reactome pathway
n/an/a 70n/an/an/an/a7.522
AstraZeneca
Assay Description
In vitro kinase assay using recombinant Aurora A purified from Sf9 cells, was incubated at room temperature with substrate, and test compounds in the...
Bioorg Med Chem Lett 16: 1320-23 (2006)
Article DOI: 10.1016/j.bmcl.2005.11.053
BindingDB Entry DOI: 10.7270/Q2WH2N7M