BDBM124107 US8754105, 23
SMILES: COc1ccc2c(O[C@@H]3C[C@@H]4N(C3)C(=O)OCCCC\C=C/[C@@H]3C[C@]3(NC4=O)C(=O)NS(=O)(=O)C3CC3)cc(nc2c1)-c1ccccc1
InChI Key: InChIKey=NWXBVPNHAHFNDG-ARFSIUBOSA-N
Data: 1 KI
Activity Spreadsheet -- Enzyme Inhibition Constant Data from BindingDB
Found 1 hit for monomerid = 124107
Trg + Lig
Ki
nM
ΔG°
kcal/mole
IC50
nM
Kd
nM
EC50/IC50
nM
koff
s-1
kon
M-1s-1
pHTemp
°C
NS3/4A protein
(Hepatitis C virus)
BDBM124107
(US8754105, 23)
Show SMILES COc1ccc2c(O[C@@H]3C[C@@H]4N(C3)C(=O)OCCCC\C=C/[C@@H]3C[C@]3(NC4=O)C(=O)NS(=O)(=O)C3CC3)cc(nc2c1)-c1ccccc1 |r,c:21|
Show InChI InChI=1S/C35H38N4O8S/c1-45-24-12-15-27-29(17-24)36-28(22-9-5-4-6-10-22)19-31(27)47-25-18-30-32(40)37-35(33(41)38-48(43,44)26-13-14-26)20-23(35)11-7-2-3-8-16-46-34(42)39(30)21-25/h4-7,9-12,15,17,19,23,25-26,30H,2-3,8,13-14,16,18,20-21H2,1H3,(H,37,40)(H,38,41)/b11-7-/t23-,25-,30+,35-/m1/s1
US Patent
0.200 -13.4n/an/an/an/an/a7.530
Medivir AB; Janssen R&D Ireland
US Patent
Assay Description
The aim of this in vitro assay was to measure the inhibition of HCV NS3/4A protease complexes by the compounds of the present invention. This assay p...
US Patent US8754105 (2014)
BindingDB Entry DOI: 10.7270/Q2QC0250