BDBM12416 BR22::copper(2+) ion 2-[(carboxylatomethyl)({[(3-{[2-(4-sulfamoylphenyl)ethyl]carbamoyl}phenyl)carbamoyl]methyl})amino]acetate
SMILES: NS(=O)(=O)c1ccc(CCNC(=O)c2cccc(NC(=O)CN(CC([O-])=O)CC([O-])=O)c2)cc1
InChI Key: InChIKey=GAUKVRYSMOROCE-UHFFFAOYSA-L
Data: 2 Kd
PDB links: 1 PDB ID contains this monomer as substructures. 1 PDB ID contains inhibitors having a similarity of 90% to this monomer.
Activity Spreadsheet -- Enzyme Inhibition Constant Data from BindingDB
Found 2 hits for monomerid = 12416
Trg + Lig
Ki
nM
ΔG°
kcal/mole
IC50
nM
Kd
nM
EC50/IC50
nM
koff
s-1
kon
M-1s-1
pHTemp
°C
Carbonic anhydrase 2
(Homo sapiens (Human))
BDBM12416
(BR22 | copper(2+) ion 2-[(carboxylatomethyl)({[(3-...)
Show SMILES NS(=O)(=O)c1ccc(CCNC(=O)c2cccc(NC(=O)CN(CC([O-])=O)CC([O-])=O)c2)cc1
Show InChI InChI=1S/C21H24N4O8S/c22-34(32,33)17-6-4-14(5-7-17)8-9-23-21(31)15-2-1-3-16(10-15)24-18(26)11-25(12-19(27)28)13-20(29)30/h1-7,10H,8-9,11-13H2,(H,23,31)(H,24,26)(H,27,28)(H,29,30)(H2,22,32,33)/p-2
Reactome pathway
n/an/an/a 80n/an/an/a7.025
University of Pennsylvania
Assay Description
The dissociation constant of the hCA and inhibitor complex was determined by competitive displacement of a fixed concentration of dansylamide by incr...
J Am Chem Soc 128: 3011-8 (2006)
Article DOI: 10.1021/ja057257n
BindingDB Entry DOI: 10.7270/Q2RR1WGF
Carbonic anhydrase 1
(Homo sapiens (Human))
BDBM12416
(BR22 | copper(2+) ion 2-[(carboxylatomethyl)({[(3-...)
Show SMILES NS(=O)(=O)c1ccc(CCNC(=O)c2cccc(NC(=O)CN(CC([O-])=O)CC([O-])=O)c2)cc1
Show InChI InChI=1S/C21H24N4O8S/c22-34(32,33)17-6-4-14(5-7-17)8-9-23-21(31)15-2-1-3-16(10-15)24-18(26)11-25(12-19(27)28)13-20(29)30/h1-7,10H,8-9,11-13H2,(H,23,31)(H,24,26)(H,27,28)(H,29,30)(H2,22,32,33)/p-2
NCI pathway
Reactome pathway
n/an/an/a 76n/an/an/a7.025
University of Pennsylvania
Assay Description
The dissociation constant of the hCA and inhibitor complex was determined by competitive displacement of a fixed concentration of dansylamide by incr...
J Am Chem Soc 128: 3011-8 (2006)
Article DOI: 10.1021/ja057257n
BindingDB Entry DOI: 10.7270/Q2RR1WGF