BDBM124245 Methyl 4-(4-benzamidophenyl)benzoate (23)
SMILES: COC(=O)c1ccc(cc1)-c1ccc(NC(=O)c2ccccc2)cc1
InChI Key: InChIKey=CBYFXCNUWJGQKP-UHFFFAOYSA-N
Data: 1 IC50
Activity Spreadsheet -- Enzyme Inhibition Constant Data from BindingDB
Found 1 hit for monomerid = 124245
Trg + Lig
Ki
nM
ΔG°
kcal/mole
IC50
nM
Kd
nM
EC50/IC50
nM
koff
s-1
kon
M-1s-1
pHTemp
°C
Protein-tyrosine phosphatase 1B
(Homo sapiens (Human))
BDBM124245
(Methyl 4-(4-benzamidophenyl)benzoate (23))
Show SMILES COC(=O)c1ccc(cc1)-c1ccc(NC(=O)c2ccccc2)cc1
Show InChI InChI=1S/C21H17NO3/c1-25-21(24)18-9-7-15(8-10-18)16-11-13-19(14-12-16)22-20(23)17-5-3-2-4-6-17/h2-14H,1H3,(H,22,23)
NCI pathway
Reactome pathway
n/an/a 1.02E+4n/an/an/an/an/an/a
Jiangnan University
Assay Description
IC50 values were determined by pNPP assay.
Bioorg Med Chem Lett 24: 1889-94 (2014)
Article DOI: 10.1016/j.bmcl.2014.03.015
BindingDB Entry DOI: 10.7270/Q2PC3122