BDBM124665 US8765940, 4-(3,3-dimethyl-6-(4-morpholinyl)-2,3-dihydro-1H-pyrrolo[3,2-b]pyridin-1-yl)-7-fluoro-3-(1-methylethyl)-2-(2-pyridinyl)quinoline
SMILES: CC(C)c1c(nc2cc(F)ccc2c1N1CC(C)(C)c2ncc(cc12)N1CCOCC1)-c1ccccn1
InChI Key: InChIKey=BCRDZWCJMRDSAI-UHFFFAOYSA-N
Data: 1 KI
Activity Spreadsheet -- Enzyme Inhibition Constant Data from BindingDB
Found 1 hit for monomerid = 124665
Trg + Lig
Ki
nM
ΔG°
kcal/mole
IC50
nM
Kd
nM
EC50/IC50
nM
koff
s-1
kon
M-1s-1
pHTemp
°C
Phosphatidylinositol 4,5-bisphosphate 3-kinase catalytic subunit alpha isoform
(Homo sapiens (Human))
BDBM124665
(US8765940, 4-(3,3-dimethyl-6-(4-morpholinyl)-2,3-d...)
Show SMILES CC(C)c1c(nc2cc(F)ccc2c1N1CC(C)(C)c2ncc(cc12)N1CCOCC1)-c1ccccn1
Show InChI InChI=1S/C30H32FN5O/c1-19(2)26-27(23-7-5-6-10-32-23)34-24-15-20(31)8-9-22(24)28(26)36-18-30(3,4)29-25(36)16-21(17-33-29)35-11-13-37-14-12-35/h5-10,15-17,19H,11-14,18H2,1-4H3
NCI pathway
Reactome pathway
US Patent
5.87n/an/an/an/an/an/a7.0n/a
Amgen Inc.
US Patent
Assay Description
A PI3K Alphascreen assay (PerkinElmer, Waltham, Mass.) was used to measure the activity of a panel of four phosphoinositide 3-kinases: PI3Kα, PI...
US Patent US8765940 (2014)
BindingDB Entry DOI: 10.7270/Q2WW7G94