BDBM124683 US8765940, 4-(3,3-dimethyl-6-(4-morpholinyl)-2,3-dihydro-1H-pyrrolo[3,2-b]pyridin-1-yl)-5-fluoro-3-methyl-2-(2-pyridinyl)quinoline
SMILES: Cc1c(nc2cccc(F)c2c1N1CC(C)(C)c2ncc(cc12)N1CCOCC1)-c1ccccn1
InChI Key: InChIKey=NURQALUBPGBZIP-UHFFFAOYSA-N
Data: 1 KI
Activity Spreadsheet -- Enzyme Inhibition Constant Data from BindingDB
Found 1 hit for monomerid = 124683
Trg + Lig
Ki
nM
ΔG°
kcal/mole
IC50
nM
Kd
nM
EC50/IC50
nM
koff
s-1
kon
M-1s-1
pHTemp
°C
Phosphatidylinositol 4,5-bisphosphate 3-kinase catalytic subunit alpha isoform
(Homo sapiens (Human))
BDBM124683
(US8765940, 4-(3,3-dimethyl-6-(4-morpholinyl)-2,3-d...)
Show SMILES Cc1c(nc2cccc(F)c2c1N1CC(C)(C)c2ncc(cc12)N1CCOCC1)-c1ccccn1
Show InChI InChI=1S/C28H28FN5O/c1-18-25(22-8-4-5-10-30-22)32-21-9-6-7-20(29)24(21)26(18)34-17-28(2,3)27-23(34)15-19(16-31-27)33-11-13-35-14-12-33/h4-10,15-16H,11-14,17H2,1-3H3
NCI pathway
Reactome pathway
US Patent
3.33n/an/an/an/an/an/a7.0n/a
Amgen Inc.
US Patent
Assay Description
A PI3K Alphascreen assay (PerkinElmer, Waltham, Mass.) was used to measure the activity of a panel of four phosphoinositide 3-kinases: PI3Kα, PI...
US Patent US8765940 (2014)
BindingDB Entry DOI: 10.7270/Q2WW7G94