BDBM124813 US8759386, 10
SMILES: Cc1nn(Cc2ccc(NC(=O)c3cc4ccccc4[nH]3)cc2)c(C)c1CC(O)=O
InChI Key: InChIKey=FHCSVHCTWZJXEX-UHFFFAOYSA-N
Data: 1 KI
Activity Spreadsheet -- Enzyme Inhibition Constant Data from BindingDB
Found 1 hit for monomerid = 124813
Trg + Lig
Ki
nM
ΔG°
kcal/mole
IC50
nM
Kd
nM
EC50/IC50
nM
koff
s-1
kon
M-1s-1
pHTemp
°C
G protein-coupled receptor 44
(Homo sapiens (Human))
BDBM124813
(US8759386, 10)
Show SMILES Cc1nn(Cc2ccc(NC(=O)c3cc4ccccc4[nH]3)cc2)c(C)c1CC(O)=O
Show InChI InChI=1S/C23H22N4O3/c1-14-19(12-22(28)29)15(2)27(26-14)13-16-7-9-18(10-8-16)24-23(30)21-11-17-5-3-4-6-20(17)25-21/h3-11,25H,12-13H2,1-2H3,(H,24,30)(H,28,29)
Reactome pathway
US Patent
0.200 -13.2n/an/an/an/an/a7.425
Boehringer Ingelheim International GmbH
US Patent
Assay Description
The CRTH2 receptor binding assay is performed in a scintillation proximity assay (SPA) format with the radioligand [3H]-PGD2 (Perkin Elmer, NET616000...
US Patent US8759386 (2014)
BindingDB Entry DOI: 10.7270/Q2S46QM5