BDBM124824 US8759386, 21
SMILES: CCc1nn(Cc2ccc(NC(=O)c3cc4ccccc4n3C)cc2)c(CC)c1CC(O)=O
InChI Key: InChIKey=RKPAETNNPDDHDM-UHFFFAOYSA-N
Data: 1 KI
Activity Spreadsheet -- Enzyme Inhibition Constant Data from BindingDB
Found 1 hit for monomerid = 124824
Trg + Lig
Ki
nM
ΔG°
kcal/mole
IC50
nM
Kd
nM
EC50/IC50
nM
koff
s-1
kon
M-1s-1
pHTemp
°C
Prostaglandin D2 receptor 2
(Homo sapiens (Human))
BDBM124824
(US8759386, 21)
Show SMILES CCc1nn(Cc2ccc(NC(=O)c3cc4ccccc4n3C)cc2)c(CC)c1CC(O)=O
Show InChI InChI=1S/C26H28N4O3/c1-4-21-20(15-25(31)32)22(5-2)30(28-21)16-17-10-12-19(13-11-17)27-26(33)24-14-18-8-6-7-9-23(18)29(24)3/h6-14H,4-5,15-16H2,1-3H3,(H,27,33)(H,31,32)
Reactome pathway
US Patent
0.300 -13.0n/an/an/an/an/a7.425
Boehringer Ingelheim International GmbH
US Patent
Assay Description
The CRTH2 receptor binding assay is performed in a scintillation proximity assay (SPA) format with the radioligand [3H]-PGD2 (Perkin Elmer, NET616000...
US Patent US8759386 (2014)
BindingDB Entry DOI: 10.7270/Q2S46QM5